{"text_format":"1","workbook":"xlsx","n_sheets":7,"sheets":["DATA","JAWABAN_PG","STATISTIK_PG","TK_KESUKARAN_PG","DY_BEDA_PG","DH_REMEDIAL_PG","COVER_PG"],"not_rendered":{"charts":2,"images":2,"macros":1,"external_links":0,"defined_names":5,"comments":0,"pivot_tables":0},"unopened":[],"bounds":{"document_bytes":16777216,"sheet_cells":100000,"rows_first":2000,"rows_last":500,"rows_between":2000,"halvings":0,"cell_chars":16384,"cell_head_chars":4096},"cells_cut":0,"cells_raw":0,"read":"whole","date_system":"1900"}

{"sheet":"DATA","index":0,"n_rows":45,"n_cols":13,"rows_kept":45,"cut":false,"hidden":false,"merged":[[19,6,21,6],[0,4,3,4],[0,5,3,6],[0,0,0,2],[1,0,1,2],[2,0,2,2],[3,0,3,2],[19,4,21,4],[19,5,21,5]]}
["KEMENTERIAN AGAMA REPUBLIK INDONESIA",null,null,null,null,"APLIKASI ANALISIS BUTIR SOAL"]
["KANTOR KEMENTERIAN AGAMA KABUPATEN TASIKMALAYA"]
[{"$f":"G5","v":"MAN 4 Tasikmalaya"}]
["Jalan Sindanghurip Ds. Cikalong Kec. Cikalong Kab. Tasikmalaya 46195"]
["NO","NISN","NAMA",null,"Nama Sekolah",":","MAN 4 Tasikmalaya",null,"Qur'an Hadis","X-A","1 (Ganjil)","2025/2026","Asesmen Sumatif Harian"]
[1,"0104009164","AGUS FIRMAN SYABANI",null,"Nama Guru",":","Arief Pribadi, S.Si.",null,"Akidah Akhlak","X-B","2 (Genap)","2026/2027","Asesmen Sumatif Akhir Semester"]
[2,"0096257187","Aisyah",null,"NIP",":","198603112020121005",null,"Fikih","X-C",null,"2027/2028","Asesmen Susmatif Akhir Tahun"]
[3,"0099072726","AMELIA CARISA PUTRI",null,"Nama Kepala Sekolah",":","Enjang, S.Ag., M.Pd.I.",null,"SKI","X-D",null,"2028/2029"]
[4,"3097509262","APINA INTAN AULIA",null,"NIP",":","197406152005011006",null,"Bahasa Arab","X-E",null,"2029/2030"]
[5,"0096438158","ARIA TIRTA ANGGARA",null,"Pelaksanaan Asesmen",":","Cikalong, 19 November 2025",null,"PKN","X-F"]
[6,"0081324455","BAGAS DWI PUTRA",null,"Mata Pelajaran",":","Kimia",null,"Bahasa Indonesia","XI-A"]
[7,"0105997732","DEA LESTARI",null,"Kelas",":","X-A",null,"Matematika","XI-B"]
[8,"0097769415","DEIS SANCI",null,"Semester",":","1 (Ganjil)",null,"Bahasa Inggris","XI-C"]
[9,"0073609592","DIANA MARWAH",null,"Tahun Pelajaran",":","2025/2026",null,"Penjaskes","XI-D"]
[10,"0093260667","ELEN PUSPITA SARI",null,"KKTP",":",75,null,"Sejarah","XI-E"]
[11,"3094067902","FEBRIAN MUHAMAD YAHPA",null,"Jenis Asesmen",":","Asesmen Sumatif Akhir Semester",null,"Seni Budaya","XI-F"]
[12,"03090982486","HIKMAL ANGGIA PRATAMA",null,"Pelaksanaan Remidi",":","Cikalong, 21 November 2025",null,"Bahasa Sunda","XII-A"]
[13,"0098360161","IKHSAN FAUZI JULIANA",null,"% Nilai_PG",":","100",null,"PKWU","XII-B"]
[14,"0092391673","INDRI",null,"% Nilai_Uraian",":","0",null,"Biologi","XII-C"]
[15,"0097558410","IRSAN EFENDI",null,"Tujuan Pembelajaran (TP)",":","asesmen sumatif akhir semester ganjil",null,"Fisika","XII-D"]
[16,"0107569281","MAYANG SRI WULAN",null,null,null,null,null,"Kimia","XII-E"]
[17,"0093343105","NEYLLA AGUSTIN",null,null,null,null,null,"Ekonomi","XII-F"]
[18,"3094158453","NURAENI",null,"Jumlah Peserta",":",{"$f":"COUNTA(C6:C45)","v":24},null,"Geografi"]
[19,"3095543410","NURI NURFATMAH",null,null,null,"@by_AP 082140206782",null,"Sosiologi"]
[20,"0094561223","PIKA AYU AMBARWATI",null,null,null,"versi 01.12.2025",null,"Informatika"]
[21,"0106627089","PUPUT DILA NOPITA SARI"]
[22,"0096736537","RAYHAN NUR RAMDANI"]
[23,"0093056273","VINI NUR AVIANI"]
[24,"0099416925","YULIA SITI QOYIMAH"]
[25]
[26]
[27]
[28]
[29]
[30]
[31]
[32]
[33]
[34]
[35]
[36]
[37]
[38]
[39]
[40]

{"sheet":"JAWABAN_PG","index":1,"n_rows":136,"n_cols":54,"rows_kept":136,"cut":false,"hidden":false,"merged":[[4,3,4,52],[4,0,7,0],[4,1,7,1]]}
[{"$f":"ROUND(DATA!G23*0.27,0)","v":6}]
[]
[]
[]
["NO","NISN","NAMA","DISTRIBUSI JAWABAN SISWA"]
[null,null,"SKOR JAWABAN",5,5,5,5,5,5,5,5,5,5,5,5,5,5,5,5,5,5,5,5]
[null,null,"NOMOR SOAL",1,2,3,4,5,6,7,8,9,10,11,12,13,14,15,16,17,18,19,20,21,22,23,24,25,26,27,28,29,30,31,32,33,34,35,36,37,38,39,40,41,42,43,44,45,46,47,48,49,50]
[null,null,"KUNCI JAWABAN","Sebagian besar volume atom adalah ruang kosong, Partikel alfa bermuatan positif, Inti atom bermuatan positif","kedua ion memiliki jumlah elektron yang sama","Salah",42,36,80,"35.5",74,"Lihat gambar, Jumlah elektron valensi atom X adalah 4, Konfigurasi elektron atom X menurut Mekanika Kuantum adalah 1s2 2s2 2p6 3s2 3p2","Salah",8,"d",2,33,"n= 3, l= 1, m= +1, s= - ½","Salah","Bilangan kuantum spin elektron terakhir adalah – ½, Bilangan kuantum magnetik elektron terakhir adalah 0, Bilangan kuantum utama elektron terakhir adalah 3",50,35,29,null,null,null,null,null,null,null,null,null,null,null,null,null,null,null,null,null,null,null,null,null,null,null,null,null,null,null,null,null,null,{"$f":"COUNTA(D8:BA8)","v":20}]
[1,{"$f":"IF(VALUE(DATA!B6)=0, \"\", TEXT(VALUE(DATA!B6), REPT(\"0\", LEN(DATA!B6))))","v":"0104009164"},{"$f":"IF(DATA!C6=\"\",\"\",DATA!C6)","v":"AGUS FIRMAN SYABANI"},"Sebagian besar volume atom adalah ruang kosong, Inti atom memiliki ukuran relatif sangat kecil, Partikel alfa bermuatan positif, Inti atom bermuatan positif","kedua ion memiliki jumlah elektron yang sama","Salah",52,36,80,"35.5",74,"Lihat gambar","Salah",8,"d ",2,33,"n= 3, l= 1, m= +1, s= - ½","Benar","Bilangan kuantum spin elektron terakhir adalah – ½, Bilangan kuantum magnetik elektron terakhir adalah 0, Bilangan kuantum azimuth elektron terakhir adalah 2, Bilangan kuantum utama elektron terakhir adalah 3",50,35,29]
[2,{"$f":"IF(VALUE(DATA!B7)=0, \"\", TEXT(VALUE(DATA!B7), REPT(\"0\", LEN(DATA!B7))))","v":"0096257187"},{"$f":"IF(DATA!C7=\"\",\"\",DATA!C7)","v":"Aisyah"},"Inti atom bermuatan positif","jumlah elektron ion magnesium > ion oksida","Salah",42,36,80,"35.5",74,"Jumlah elektron valensi atom X adalah 4","Benar","8.","3d",2,33,"n= 3, l= 1, m= +1, s= - ½","Benar","Bilangan kuantum magnetik elektron terakhir adalah 0",50,35,29]
[3,{"$f":"IF(VALUE(DATA!B8)=0, \"\", TEXT(VALUE(DATA!B8), REPT(\"0\", LEN(DATA!B8))))","v":"0099072726"},{"$f":"IF(DATA!C8=\"\",\"\",DATA!C8)","v":"AMELIA CARISA PUTRI"},"Inti atom bermuatan positif","kedua ion memiliki jumlah elektron yang sama","Salah",42,36,80,"35.5",53,"Lihat gambar, Konfigurasi elektron atom X menurut Niels Bohr adalah 2, 8, 18, Konfigurasi elektron atom X menurut Mekanika Kuantum adalah 1s2 2s2 2p6 3s2 3p2","Benar",8,"3d",2,33,"n= 3, l= 1, m= +1, s= - ½","Salah","Jumlah elektron valensi atom Y adalah 5, Bilangan kuantum spin elektron terakhir adalah – ½",50,35,29]
[4,{"$f":"IF(VALUE(DATA!B9)=0, \"\", TEXT(VALUE(DATA!B9), REPT(\"0\", LEN(DATA!B9))))","v":"3097509262"},{"$f":"IF(DATA!C9=\"\",\"\",DATA!C9)","v":"APINA INTAN AULIA"},"Inti atom bermuatan positif","jumlah elektron ion magnesium > ion oksida","Salah",42,36,80,"35.5",74,"Konfigurasi elektron atom X menurut Mekanika Kuantum adalah 1s2 2s2 2p6 3s2 3p2","Benar","8.","3d",2,33,"n= 3, l= 1, m= +1, s= - ½","Benar","Bilangan kuantum spin elektron terakhir adalah – ½",50,35,29]
[5,{"$f":"IF(VALUE(DATA!B10)=0, \"\", TEXT(VALUE(DATA!B10), REPT(\"0\", LEN(DATA!B10))))","v":"0096438158"},{"$f":"IF(DATA!C10=\"\",\"\",DATA!C10)","v":"ARIA TIRTA ANGGARA"}]
[6,{"$f":"IF(VALUE(DATA!B11)=0, \"\", TEXT(VALUE(DATA!B11), REPT(\"0\", LEN(DATA!B11))))","v":"0081324455"},{"$f":"IF(DATA!C11=\"\",\"\",DATA!C11)","v":"BAGAS DWI PUTRA"},"Sebagian besar volume atom adalah ruang kosong, Inti atom memiliki ukuran relatif sangat kecil, Semua partikel alfa dapat masuk ke inti atom, Partikel alfa bermuatan positif, Inti atom bermuatan positif","ion oksida termasuk kation, dan ion magnesium termasuk anion","Benar",52,36,80,"35.5",74,"Jumlah elektron valensi atom X adalah 4, Konfigurasi elektron atom X menurut Mekanika Kuantum adalah 1s2 2s2 2p6 3s2 3p2","Salah",8,"3d",2,33,"n= 3, l= 1, m= +1, s= - ½","Salah","Bilangan kuantum spin elektron terakhir adalah – ½, Bilangan kuantum magnetik elektron terakhir adalah 0, Bilangan kuantum utama elektron terakhir adalah 3",50,35,29]
[7,{"$f":"IF(VALUE(DATA!B12)=0, \"\", TEXT(VALUE(DATA!B12), REPT(\"0\", LEN(DATA!B12))))","v":"0105997732"},{"$f":"IF(DATA!C12=\"\",\"\",DATA!C12)","v":"DEA LESTARI"},"Sebagian besar volume atom adalah ruang kosong, Semua partikel alfa dapat masuk ke inti atom","jumlah neutron ion oksida > ion magnesium","Benar",42,36,80,"35.5",67,"Konfigurasi elektron atom X menurut Mekanika Kuantum adalah 1s2 2s2 2p6 3s2 3p2","Benar","8.","3d",2,33,"n= 4, l= 0, m= 0, s= - ½","Benar","Jumlah elektron valensi atom Y adalah 5",50,35,29]
[8,{"$f":"IF(VALUE(DATA!B13)=0, \"\", TEXT(VALUE(DATA!B13), REPT(\"0\", LEN(DATA!B13))))","v":"0097769415"},{"$f":"IF(DATA!C13=\"\",\"\",DATA!C13)","v":"DEIS SANCI"},"Inti atom bermuatan positif","kedua ion memiliki jumlah elektron yang sama","Benar",52,36,80,"35.5",74,"Konfigurasi elektron atom X menurut Mekanika Kuantum adalah 1s2 2s2 2p6 3s2 3p2","Salah","8.","3d",2,33,"n= 3, l= 1, m= +1, s= - ½","Benar","Jumlah elektron valensi atom Y adalah 5, Bilangan kuantum spin elektron terakhir adalah – ½, Bilangan kuantum utama elektron terakhir adalah 3",50,35,29]
[9,{"$f":"IF(VALUE(DATA!B14)=0, \"\", TEXT(VALUE(DATA!B14), REPT(\"0\", LEN(DATA!B14))))","v":"0073609592"},{"$f":"IF(DATA!C14=\"\",\"\",DATA!C14)","v":"DIANA MARWAH"},"Inti atom bermuatan positif","kedua ion memiliki jumlah elektron yang sama","Salah",52,36,80,"35.5",53,"Lihat gambar, Konfigurasi elektron atom X menurut Niels Bohr adalah 2, 8, 18, Konfigurasi elektron atom X menurut Mekanika Kuantum adalah 1s2 2s2 2p6 3s2 3p2","Benar",8,"3d",2,33,"n= 3, l= 1, m= +1, s= - ½","Salah","Jumlah elektron valensi atom Y adalah 5, Bilangan kuantum spin elektron terakhir adalah – ½, Bilangan kuantum utama elektron terakhir adalah 3",50,35,29]
[10,{"$f":"IF(VALUE(DATA!B15)=0, \"\", TEXT(VALUE(DATA!B15), REPT(\"0\", LEN(DATA!B15))))","v":"0093260667"},{"$f":"IF(DATA!C15=\"\",\"\",DATA!C15)","v":"ELEN PUSPITA SARI"},"Semua partikel alfa dapat masuk ke inti atom","kedua ion memiliki jumlah elektron yang sama","Salah",42,36,80,"35.5",74,"Konfigurasi elektron atom X menurut Niels Bohr adalah 2, 8, 18","Salah",8,"3d",2,33,"n= 3, l= 2, m= -1, s= + ½","Salah","Bilangan kuantum spin elektron terakhir adalah – ½",50,35,29]
[11,{"$f":"IF(VALUE(DATA!B16)=0, \"\", TEXT(VALUE(DATA!B16), REPT(\"0\", LEN(DATA!B16))))","v":"3094067902"},{"$f":"IF(DATA!C16=\"\",\"\",DATA!C16)","v":"FEBRIAN MUHAMAD YAHPA"},null,null,null,null,36,80,"35.5",74,"Konfigurasi elektron atom X menurut Niels Bohr adalah 2, 8, 18","Salah","8.","3d.",2,null,"n= 3, l= 2, m= -2, s= + ½","Benar","Bilangan kuantum utama elektron terakhir adalah 3","50.","35.",29]
[12,{"$f":"IF(VALUE(DATA!B17)=0, \"\", TEXT(VALUE(DATA!B17), REPT(\"0\", LEN(DATA!B17))))","v":"03090982486"},{"$f":"IF(DATA!C17=\"\",\"\",DATA!C17)","v":"HIKMAL ANGGIA PRATAMA"},"Sebagian besar volume atom adalah ruang kosong","kedua ion memiliki jumlah elektron yang sama","Salah",52,36,80," 35.5",74,"Konfigurasi elektron atom X menurut Niels Bohr adalah 2, 8, 18","Salah",8,"3d",2,33,"n= 4, l= 0, m= 0, s= - ½","Benar","Bilangan kuantum spin elektron terakhir adalah – ½",50,35,29]
[13,{"$f":"IF(VALUE(DATA!B18)=0, \"\", TEXT(VALUE(DATA!B18), REPT(\"0\", LEN(DATA!B18))))","v":"0098360161"},{"$f":"IF(DATA!C18=\"\",\"\",DATA!C18)","v":"IKHSAN FAUZI JULIANA"},"Sebagian besar volume atom adalah ruang kosong","ion oksida termasuk kation, dan ion magnesium termasuk anion","Benar",52,36,80,"35.5",74,"Lihat gambar, Konfigurasi elektron atom X menurut Niels Bohr adalah 2, 8, 18, Jumlah elektron valensi atom X adalah 4","Benar",8,"3d",2,33,"n= 4, l= 0, m= 0, s= - ½","Benar","Jumlah elektron valensi atom Y adalah 5, Bilangan kuantum azimuth elektron terakhir adalah 2, Bilangan kuantum utama elektron terakhir adalah 3",50,35,29]
[14,{"$f":"IF(VALUE(DATA!B19)=0, \"\", TEXT(VALUE(DATA!B19), REPT(\"0\", LEN(DATA!B19))))","v":"0092391673"},{"$f":"IF(DATA!C19=\"\",\"\",DATA!C19)","v":"INDRI"},"Sebagian besar volume atom adalah ruang kosong, Inti atom memiliki ukuran relatif sangat kecil, Partikel alfa bermuatan positif, Inti atom bermuatan positif","kedua ion memiliki jumlah elektron yang sama","Salah",52,36,80,"35.5",74,"Konfigurasi elektron atom X menurut Mekanika Kuantum adalah 1s2 2s2 2p6 3s2 3p2","Salah",8,"3d",2,33,"n= 3, l= 2, m= -2, s= + ½","Benar","Bilangan kuantum spin elektron terakhir adalah – ½",null,35,29]
[15,{"$f":"IF(VALUE(DATA!B20)=0, \"\", TEXT(VALUE(DATA!B20), REPT(\"0\", LEN(DATA!B20))))","v":"0097558410"},{"$f":"IF(DATA!C20=\"\",\"\",DATA!C20)","v":"IRSAN EFENDI"},"Inti atom memiliki ukuran relatif sangat kecil","kedua ion memiliki jumlah elektron yang sama","Salah",52,36,80,"35.5",53,"Lihat gambar, Konfigurasi elektron atom X menurut Niels Bohr adalah 2, 8, 18, Konfigurasi elektron atom X menurut Mekanika Kuantum adalah 1s2 2s2 2p6 3s2 3p2","Benar",8,"3d",2,33,"n= 3, l= 2, m= -2, s= + ½","Benar","Jumlah elektron valensi atom Y adalah 5, Bilangan kuantum azimuth elektron terakhir adalah 2, Bilangan kuantum utama elektron terakhir adalah 3",50,35,29]
[16,{"$f":"IF(VALUE(DATA!B21)=0, \"\", TEXT(VALUE(DATA!B21), REPT(\"0\", LEN(DATA!B21))))","v":"0107569281"},{"$f":"IF(DATA!C21=\"\",\"\",DATA!C21)","v":"MAYANG SRI WULAN"},"Sebagian besar volume atom adalah ruang kosong, Inti atom memiliki ukuran relatif sangat kecil, Partikel alfa bermuatan positif, Inti atom bermuatan positif","kedua ion memiliki jumlah elektron yang sama","Salah",52,36,80,"35.5",53,"Lihat gambar, Konfigurasi elektron atom X menurut Niels Bohr adalah 2, 8, 18, Konfigurasi elektron atom X menurut Mekanika Kuantum adalah 1s2 2s2 2p6 3s2 3p2","Benar",8,"3d",2,33,"n= 3, l= 2, m= -2, s= + ½","Benar","Jumlah elektron valensi atom Y adalah 5, Bilangan kuantum azimuth elektron terakhir adalah 2, Bilangan kuantum utama elektron terakhir adalah 3",50,35,29]
[17,{"$f":"IF(VALUE(DATA!B22)=0, \"\", TEXT(VALUE(DATA!B22), REPT(\"0\", LEN(DATA!B22))))","v":"0093343105"},{"$f":"IF(DATA!C22=\"\",\"\",DATA!C22)","v":"NEYLLA AGUSTIN"},"Sebagian besar volume atom adalah ruang kosong, Inti atom memiliki ukuran relatif sangat kecil, Partikel alfa bermuatan positif, Inti atom bermuatan positif","kedua ion memiliki jumlah elektron yang sama","Salah",52,36,80,"35.5",53,"Lihat gambar, Konfigurasi elektron atom X menurut Niels Bohr adalah 2, 8, 18, Nomor massa isotop yang tidak stabil < dari nomor massa isotop yang stabil","Salah",8,"3d",2,33,"n= 3, l= 1, m= +1, s= - ½","Salah","Jumlah elektron valensi atom Y adalah 5, Bilangan kuantum azimuth elektron terakhir adalah 2, Bilangan kuantum utama elektron terakhir adalah 3",50,35,29]
[18,{"$f":"IF(VALUE(DATA!B23)=0, \"\", TEXT(VALUE(DATA!B23), REPT(\"0\", LEN(DATA!B23))))","v":"3094158453"},{"$f":"IF(DATA!C23=\"\",\"\",DATA!C23)","v":"NURAENI"},"Sebagian besar volume atom adalah ruang kosong, Inti atom memiliki ukuran relatif sangat kecil, Partikel alfa bermuatan positif","ion oksida termasuk kation, dan ion magnesium termasuk anion","Benar",52,36,80,"35.5",53,"Lihat gambar, Konfigurasi elektron atom X menurut Niels Bohr adalah 2, 8, 18, Konfigurasi elektron atom X menurut Mekanika Kuantum adalah 1s2 2s2 2p6 3s2 3p2","Salah",8,"3d",2,33,"n= 3, l= 2, m= -2, s= + ½","Benar","Jumlah elektron valensi atom Y adalah 5, Bilangan kuantum azimuth elektron terakhir adalah 2, Bilangan kuantum utama elektron terakhir adalah 3",50,35,29]
[19,{"$f":"IF(VALUE(DATA!B24)=0, \"\", TEXT(VALUE(DATA!B24), REPT(\"0\", LEN(DATA!B24))))","v":"3095543410"},{"$f":"IF(DATA!C24=\"\",\"\",DATA!C24)","v":"NURI NURFATMAH"},"Semua partikel alfa dapat masuk ke inti atom, Partikel alfa bermuatan positif, Inti atom bermuatan positif","jumlah neutron ion oksida > ion magnesium","Benar",52,36,80,"35.5",53,"Lihat gambar, Konfigurasi elektron atom X menurut Niels Bohr adalah 2, 8, 18, Konfigurasi elektron atom X menurut Mekanika Kuantum adalah 1s2 2s2 2p6 3s2 3p2","Salah",8,"3d",2,33,"n= 3, l= 2, m= -2, s= + ½","Benar","Jumlah elektron valensi atom Y adalah 5, Bilangan kuantum azimuth elektron terakhir adalah 2, Bilangan kuantum utama elektron terakhir adalah 3",50,35,29]
[20,{"$f":"IF(VALUE(DATA!B25)=0, \"\", TEXT(VALUE(DATA!B25), REPT(\"0\", LEN(DATA!B25))))","v":"0094561223"},{"$f":"IF(DATA!C25=\"\",\"\",DATA!C25)","v":"PIKA AYU AMBARWATI"},"Sebagian besar volume atom adalah ruang kosong, Inti atom memiliki ukuran relatif sangat kecil, Partikel alfa bermuatan positif","jumlah neutron ion oksida > ion magnesium","Benar",52,36,80,"35.5",53,"Lihat gambar, Konfigurasi elektron atom X menurut Niels Bohr adalah 2, 8, 18, Konfigurasi elektron atom X menurut Mekanika Kuantum adalah 1s2 2s2 2p6 3s2 3p2","Benar",8,"3d",2,33,"n= 3, l= 2, m= -2, s= + ½","Benar","Jumlah elektron valensi atom Y adalah 5, Bilangan kuantum azimuth elektron terakhir adalah 2, Bilangan kuantum utama elektron terakhir adalah 3",50,35,29]
[21,{"$f":"IF(VALUE(DATA!B26)=0, \"\", TEXT(VALUE(DATA!B26), REPT(\"0\", LEN(DATA!B26))))","v":"0106627089"},{"$f":"IF(DATA!C26=\"\",\"\",DATA!C26)","v":"PUPUT DILA NOPITA SARI"},"Sebagian besar volume atom adalah ruang kosong, Inti atom memiliki ukuran relatif sangat kecil, Partikel alfa bermuatan positif, Inti atom bermuatan positif","kedua ion memiliki jumlah elektron yang sama","Salah",52,36,80,"35.5",74,"Konfigurasi elektron atom X menurut Mekanika Kuantum adalah 1s2 2s2 2p6 3s2 3p2","Salah",8,"3d",2,33,"n= 3, l= 1, m= +1, s= - ½","Salah","Bilangan kuantum spin elektron terakhir adalah – ½, Bilangan kuantum magnetik elektron terakhir adalah 0, Bilangan kuantum utama elektron terakhir adalah 3",50,35,29]
[22,{"$f":"IF(VALUE(DATA!B27)=0, \"\", TEXT(VALUE(DATA!B27), REPT(\"0\", LEN(DATA!B27))))","v":"0096736537"},{"$f":"IF(DATA!C27=\"\",\"\",DATA!C27)","v":"RAYHAN NUR RAMDANI"},"Sebagian besar volume atom adalah ruang kosong, Inti atom memiliki ukuran relatif sangat kecil, Partikel alfa bermuatan positif, Inti atom bermuatan positif","kedua ion memiliki jumlah elektron yang sama","Salah",52,36,80,"35.5",53,"Lihat gambar, Konfigurasi elektron atom X menurut Niels Bohr adalah 2, 8, 18, Konfigurasi elektron atom X menurut Mekanika Kuantum adalah 1s2 2s2 2p6 3s2 3p2","Salah",8,"3d",2,33,"n= 3, l= 2, m= -2, s= + ½","Benar","Jumlah elektron valensi atom Y adalah 5, Bilangan kuantum azimuth elektron terakhir adalah 2, Bilangan kuantum utama elektron terakhir adalah 3",50,35,29]
[23,{"$f":"IF(VALUE(DATA!B28)=0, \"\", TEXT(VALUE(DATA!B28), REPT(\"0\", LEN(DATA!B28))))","v":"0093056273"},{"$f":"IF(DATA!C28=\"\",\"\",DATA!C28)","v":"VINI NUR AVIANI"},"Inti atom memiliki ukuran relatif sangat kecil, Semua partikel alfa dapat masuk ke inti atom, Inti atom bermuatan positif","jumlah neutron ion oksida > ion magnesium","Benar",52,36,80,"35.5",53,"Lihat gambar, Konfigurasi elektron atom X menurut Niels Bohr adalah 2, 8, 18, Konfigurasi elektron atom X menurut Mekanika Kuantum adalah 1s2 2s2 2p6 3s2 3p2","Benar",8,"3d",2,33,"n= 3, l= 2, m= -1, s= + ½","Salah","Bilangan kuantum spin elektron terakhir adalah – ½, Bilangan kuantum magnetik elektron terakhir adalah 0, Bilangan kuantum utama elektron terakhir adalah 3",50,35,29]
[24,{"$f":"IF(VALUE(DATA!B29)=0, \"\", TEXT(VALUE(DATA!B29), REPT(\"0\", LEN(DATA!B29))))","v":"0099416925"},{"$f":"IF(DATA!C29=\"\",\"\",DATA!C29)","v":"YULIA SITI QOYIMAH"},"Inti atom memiliki ukuran relatif sangat kecil, Semua partikel alfa dapat masuk ke inti atom, Inti atom bermuatan positif","jumlah neutron ion oksida > ion magnesium","Salah"]
[25,{"$f":"IF(VALUE(DATA!B30)=0, \"\", TEXT(VALUE(DATA!B30), REPT(\"0\", LEN(DATA!B30))))","v":""},{"$f":"IF(DATA!C30=\"\",\"\",DATA!C30)","v":""}]
[26,{"$f":"IF(VALUE(DATA!B31)=0, \"\", TEXT(VALUE(DATA!B31), REPT(\"0\", LEN(DATA!B31))))","v":""},{"$f":"IF(DATA!C31=\"\",\"\",DATA!C31)","v":""}]
[27,{"$f":"IF(VALUE(DATA!B32)=0, \"\", TEXT(VALUE(DATA!B32), REPT(\"0\", LEN(DATA!B32))))","v":""},{"$f":"IF(DATA!C32=\"\",\"\",DATA!C32)","v":""}]
[28,{"$f":"IF(VALUE(DATA!B33)=0, \"\", TEXT(VALUE(DATA!B33), REPT(\"0\", LEN(DATA!B33))))","v":""},{"$f":"IF(DATA!C33=\"\",\"\",DATA!C33)","v":""}]
[29,{"$f":"IF(VALUE(DATA!B34)=0, \"\", TEXT(VALUE(DATA!B34), REPT(\"0\", LEN(DATA!B34))))","v":""},{"$f":"IF(DATA!C34=\"\",\"\",DATA!C34)","v":""}]
[30,{"$f":"IF(VALUE(DATA!B35)=0, \"\", TEXT(VALUE(DATA!B35), REPT(\"0\", LEN(DATA!B35))))","v":""},{"$f":"IF(DATA!C35=\"\",\"\",DATA!C35)","v":""}]
[31,{"$f":"IF(VALUE(DATA!B36)=0, \"\", TEXT(VALUE(DATA!B36), REPT(\"0\", LEN(DATA!B36))))","v":""},{"$f":"IF(DATA!C36=\"\",\"\",DATA!C36)","v":""}]
[32,{"$f":"IF(VALUE(DATA!B37)=0, \"\", TEXT(VALUE(DATA!B37), REPT(\"0\", LEN(DATA!B37))))","v":""},{"$f":"IF(DATA!C37=\"\",\"\",DATA!C37)","v":""}]
[33,{"$f":"IF(VALUE(DATA!B38)=0, \"\", TEXT(VALUE(DATA!B38), REPT(\"0\", LEN(DATA!B38))))","v":""},{"$f":"IF(DATA!C38=\"\",\"\",DATA!C38)","v":""}]
[34,{"$f":"IF(VALUE(DATA!B39)=0, \"\", TEXT(VALUE(DATA!B39), REPT(\"0\", LEN(DATA!B39))))","v":""},{"$f":"IF(DATA!C39=\"\",\"\",DATA!C39)","v":""}]
[35,{"$f":"IF(VALUE(DATA!B40)=0, \"\", TEXT(VALUE(DATA!B40), REPT(\"0\", LEN(DATA!B40))))","v":""},{"$f":"IF(DATA!C40=\"\",\"\",DATA!C40)","v":""}]
[36,{"$f":"IF(VALUE(DATA!B41)=0, \"\", TEXT(VALUE(DATA!B41), REPT(\"0\", LEN(DATA!B41))))","v":""},{"$f":"IF(DATA!C41=\"\",\"\",DATA!C41)","v":""}]
[37,{"$f":"IF(VALUE(DATA!B42)=0, \"\", TEXT(VALUE(DATA!B42), REPT(\"0\", LEN(DATA!B42))))","v":""},{"$f":"IF(DATA!C42=\"\",\"\",DATA!C42)","v":""}]
[38,{"$f":"IF(VALUE(DATA!B43)=0, \"\", TEXT(VALUE(DATA!B43), REPT(\"0\", LEN(DATA!B43))))","v":""},{"$f":"IF(DATA!C43=\"\",\"\",DATA!C43)","v":""}]
[39,{"$f":"IF(VALUE(DATA!B44)=0, \"\", TEXT(VALUE(DATA!B44), REPT(\"0\", LEN(DATA!B44))))","v":""},{"$f":"IF(DATA!C44=\"\",\"\",DATA!C44)","v":""}]
[40,{"$f":"IF(VALUE(DATA!B45)=0, \"\", TEXT(VALUE(DATA!B45), REPT(\"0\", LEN(DATA!B45))))","v":""},{"$f":"IF(DATA!C45=\"\",\"\",DATA!C45)","v":""}]
[]
[1,null,null,{"$f":"IF(COUNTA($D9:$BA9)=0,\"\",IF(COLUMN()-COLUMN($D$8)+1>$BB$8,IF(TRIM(D9)=\"\",\"\",IF(D9=D$8,1,0)),IF(D9=D$8,1,0)))","v":0},{"$f":"IF(COUNTA($D9:$BA9)=0,\"\",IF(COLUMN()-COLUMN($D$8)+1>$BB$8,IF(TRIM(E9)=\"\",\"\",IF(E9=E$8,1,0)),IF(E9=E$8,1,0)))","v":1},1,0,1,1,1,1,0,1,1,0,1,1,1,0,0,1,1,1,"","","","","","","","","","","","","","","","","","","","","","","","","","","","","","",{"$f":"_xlfn.TEXTJOIN(\"; \", TRUE, IF(D50:BA50=0, COLUMN(D50:BA50)-COLUMN(D50)+1, \"\"))","v":"1; 4; 9; 12; 16; 17"}]
[2,null,null,{"$f":"IF(COUNTA($D10:$BA10)=0,\"\",IF(COLUMN()-COLUMN($D$8)+1>$BB$8,IF(TRIM(D10)=\"\",\"\",IF(D10=D$8,1,0)),IF(D10=D$8,1,0)))","v":0},0,1,1,1,1,1,1,0,0,0,0,1,1,1,0,0,1,1,1,"","","","","","","","","","","","","","","","","","","","","","","","","","","","","","",{"$f":"_xlfn.TEXTJOIN(\"; \", TRUE, IF(D51:BA51=0, COLUMN(D51:BA51)-COLUMN(D51)+1, \"\"))","v":"1; 2; 9; 10; 11; 12; 16; 17"}]
[3,null,null,{"$f":"IF(COUNTA($D11:$BA11)=0,\"\",IF(COLUMN()-COLUMN($D$8)+1>$BB$8,IF(TRIM(D11)=\"\",\"\",IF(D11=D$8,1,0)),IF(D11=D$8,1,0)))","v":0},1,1,1,1,1,1,0,0,0,1,0,1,1,1,1,0,1,1,1,"","","","","","","","","","","","","","","","","","","","","","","","","","","","","","",{"$f":"_xlfn.TEXTJOIN(\"; \", TRUE, IF(D52:BA52=0, COLUMN(D52:BA52)-COLUMN(D52)+1, \"\"))","v":"1; 8; 9; 10; 12; 17"}]
[4,null,null,{"$f":"IF(COUNTA($D12:$BA12)=0,\"\",IF(COLUMN()-COLUMN($D$8)+1>$BB$8,IF(TRIM(D12)=\"\",\"\",IF(D12=D$8,1,0)),IF(D12=D$8,1,0)))","v":0},0,1,1,1,1,1,1,0,0,0,0,1,1,1,0,0,1,1,1,"","","","","","","","","","","","","","","","","","","","","","","","","","","","","","",{"$f":"_xlfn.TEXTJOIN(\"; \", TRUE, IF(D53:BA53=0, COLUMN(D53:BA53)-COLUMN(D53)+1, \"\"))","v":"1; 2; 9; 10; 11; 12; 16; 17"}]
[5,null,null,{"$f":"IF(COUNTA($D13:$BA13)=0,\"\",IF(COLUMN()-COLUMN($D$8)+1>$BB$8,IF(TRIM(D13)=\"\",\"\",IF(D13=D$8,1,0)),IF(D13=D$8,1,0)))","v":""},"","","","","","","","","","","","","","","","","","","","","","","","","","","","","","","","","","","","","","","","","","","","","","","","","",{"$f":"_xlfn.TEXTJOIN(\"; \", TRUE, IF(D54:BA54=0, COLUMN(D54:BA54)-COLUMN(D54)+1, \"\"))","v":""}]
[6,null,null,{"$f":"IF(COUNTA($D14:$BA14)=0,\"\",IF(COLUMN()-COLUMN($D$8)+1>$BB$8,IF(TRIM(D14)=\"\",\"\",IF(D14=D$8,1,0)),IF(D14=D$8,1,0)))","v":0},0,0,0,1,1,1,1,0,1,1,0,1,1,1,1,1,1,1,1,"","","","","","","","","","","","","","","","","","","","","","","","","","","","","","",{"$f":"_xlfn.TEXTJOIN(\"; \", TRUE, IF(D55:BA55=0, COLUMN(D55:BA55)-COLUMN(D55)+1, \"\"))","v":"1; 2; 3; 4; 9; 12"}]
[7,null,null,{"$f":"IF(COUNTA($D15:$BA15)=0,\"\",IF(COLUMN()-COLUMN($D$8)+1>$BB$8,IF(TRIM(D15)=\"\",\"\",IF(D15=D$8,1,0)),IF(D15=D$8,1,0)))","v":0},0,0,1,1,1,1,0,0,0,0,0,1,1,0,0,0,1,1,1,"","","","","","","","","","","","","","","","","","","","","","","","","","","","","","",{"$f":"_xlfn.TEXTJOIN(\"; \", TRUE, IF(D56:BA56=0, COLUMN(D56:BA56)-COLUMN(D56)+1, \"\"))","v":"1; 2; 3; 8; 9; 10; 11; 12; 15; 16; 17"}]
[8,null,null,{"$f":"IF(COUNTA($D16:$BA16)=0,\"\",IF(COLUMN()-COLUMN($D$8)+1>$BB$8,IF(TRIM(D16)=\"\",\"\",IF(D16=D$8,1,0)),IF(D16=D$8,1,0)))","v":0},1,0,0,1,1,1,1,0,1,0,0,1,1,1,0,0,1,1,1,"","","","","","","","","","","","","","","","","","","","","","","","","","","","","","",{"$f":"_xlfn.TEXTJOIN(\"; \", TRUE, IF(D57:BA57=0, COLUMN(D57:BA57)-COLUMN(D57)+1, \"\"))","v":"1; 3; 4; 9; 11; 12; 16; 17"}]
[9,null,null,{"$f":"IF(COUNTA($D17:$BA17)=0,\"\",IF(COLUMN()-COLUMN($D$8)+1>$BB$8,IF(TRIM(D17)=\"\",\"\",IF(D17=D$8,1,0)),IF(D17=D$8,1,0)))","v":0},1,1,0,1,1,1,0,0,0,1,0,1,1,1,1,0,1,1,1,"","","","","","","","","","","","","","","","","","","","","","","","","","","","","","",{"$f":"_xlfn.TEXTJOIN(\"; \", TRUE, IF(D58:BA58=0, COLUMN(D58:BA58)-COLUMN(D58)+1, \"\"))","v":"1; 4; 8; 9; 10; 12; 17"}]
[10,null,null,{"$f":"IF(COUNTA($D18:$BA18)=0,\"\",IF(COLUMN()-COLUMN($D$8)+1>$BB$8,IF(TRIM(D18)=\"\",\"\",IF(D18=D$8,1,0)),IF(D18=D$8,1,0)))","v":0},1,1,1,1,1,1,1,0,1,1,0,1,1,0,1,0,1,1,1,"","","","","","","","","","","","","","","","","","","","","","","","","","","","","","",{"$f":"_xlfn.TEXTJOIN(\"; \", TRUE, IF(D59:BA59=0, COLUMN(D59:BA59)-COLUMN(D59)+1, \"\"))","v":"1; 9; 12; 15; 17"}]
[11,null,null,{"$f":"IF(COUNTA($D19:$BA19)=0,\"\",IF(COLUMN()-COLUMN($D$8)+1>$BB$8,IF(TRIM(D19)=\"\",\"\",IF(D19=D$8,1,0)),IF(D19=D$8,1,0)))","v":0},0,0,0,1,1,1,1,0,1,0,0,1,0,0,0,0,0,0,1,"","","","","","","","","","","","","","","","","","","","","","","","","","","","","","",{"$f":"_xlfn.TEXTJOIN(\"; \", TRUE, IF(D60:BA60=0, COLUMN(D60:BA60)-COLUMN(D60)+1, \"\"))","v":"1; 2; 3; 4; 9; 11; 12; 14; 15; 16; 17; 18; 19"}]
[12,null,null,{"$f":"IF(COUNTA($D20:$BA20)=0,\"\",IF(COLUMN()-COLUMN($D$8)+1>$BB$8,IF(TRIM(D20)=\"\",\"\",IF(D20=D$8,1,0)),IF(D20=D$8,1,0)))","v":0},1,1,0,1,1,0,1,0,1,1,0,1,1,0,0,0,1,1,1,"","","","","","","","","","","","","","","","","","","","","","","","","","","","","","",{"$f":"_xlfn.TEXTJOIN(\"; \", TRUE, IF(D61:BA61=0, COLUMN(D61:BA61)-COLUMN(D61)+1, \"\"))","v":"1; 4; 7; 9; 12; 15; 16; 17"}]
[13,null,null,{"$f":"IF(COUNTA($D21:$BA21)=0,\"\",IF(COLUMN()-COLUMN($D$8)+1>$BB$8,IF(TRIM(D21)=\"\",\"\",IF(D21=D$8,1,0)),IF(D21=D$8,1,0)))","v":0},0,0,0,1,1,1,1,0,0,1,0,1,1,0,0,0,1,1,1,"","","","","","","","","","","","","","","","","","","","","","","","","","","","","","",{"$f":"_xlfn.TEXTJOIN(\"; \", TRUE, IF(D62:BA62=0, COLUMN(D62:BA62)-COLUMN(D62)+1, \"\"))","v":"1; 2; 3; 4; 9; 10; 12; 15; 16; 17"}]
[14,null,null,{"$f":"IF(COUNTA($D22:$BA22)=0,\"\",IF(COLUMN()-COLUMN($D$8)+1>$BB$8,IF(TRIM(D22)=\"\",\"\",IF(D22=D$8,1,0)),IF(D22=D$8,1,0)))","v":0},1,1,0,1,1,1,1,0,1,1,0,1,1,0,0,0,0,1,1,"","","","","","","","","","","","","","","","","","","","","","","","","","","","","","",{"$f":"_xlfn.TEXTJOIN(\"; \", TRUE, IF(D63:BA63=0, COLUMN(D63:BA63)-COLUMN(D63)+1, \"\"))","v":"1; 4; 9; 12; 15; 16; 17; 18"}]
[15,null,null,{"$f":"IF(COUNTA($D23:$BA23)=0,\"\",IF(COLUMN()-COLUMN($D$8)+1>$BB$8,IF(TRIM(D23)=\"\",\"\",IF(D23=D$8,1,0)),IF(D23=D$8,1,0)))","v":0},1,1,0,1,1,1,0,0,0,1,0,1,1,0,0,0,1,1,1,"","","","","","","","","","","","","","","","","","","","","","","","","","","","","","",{"$f":"_xlfn.TEXTJOIN(\"; \", TRUE, IF(D64:BA64=0, COLUMN(D64:BA64)-COLUMN(D64)+1, \"\"))","v":"1; 4; 8; 9; 10; 12; 15; 16; 17"}]
[16,null,null,{"$f":"IF(COUNTA($D24:$BA24)=0,\"\",IF(COLUMN()-COLUMN($D$8)+1>$BB$8,IF(TRIM(D24)=\"\",\"\",IF(D24=D$8,1,0)),IF(D24=D$8,1,0)))","v":0},1,1,0,1,1,1,0,0,0,1,0,1,1,0,0,0,1,1,1,"","","","","","","","","","","","","","","","","","","","","","","","","","","","","","",{"$f":"_xlfn.TEXTJOIN(\"; \", TRUE, IF(D65:BA65=0, COLUMN(D65:BA65)-COLUMN(D65)+1, \"\"))","v":"1; 4; 8; 9; 10; 12; 15; 16; 17"}]
[17,null,null,{"$f":"IF(COUNTA($D25:$BA25)=0,\"\",IF(COLUMN()-COLUMN($D$8)+1>$BB$8,IF(TRIM(D25)=\"\",\"\",IF(D25=D$8,1,0)),IF(D25=D$8,1,0)))","v":0},1,1,0,1,1,1,0,0,1,1,0,1,1,1,1,0,1,1,1,"","","","","","","","","","","","","","","","","","","","","","","","","","","","","","",{"$f":"_xlfn.TEXTJOIN(\"; \", TRUE, IF(D66:BA66=0, COLUMN(D66:BA66)-COLUMN(D66)+1, \"\"))","v":"1; 4; 8; 9; 12; 17"}]
[18,null,null,{"$f":"IF(COUNTA($D26:$BA26)=0,\"\",IF(COLUMN()-COLUMN($D$8)+1>$BB$8,IF(TRIM(D26)=\"\",\"\",IF(D26=D$8,1,0)),IF(D26=D$8,1,0)))","v":0},0,0,0,1,1,1,0,0,1,1,0,1,1,0,0,0,1,1,1,"","","","","","","","","","","","","","","","","","","","","","","","","","","","","","",{"$f":"_xlfn.TEXTJOIN(\"; \", TRUE, IF(D67:BA67=0, COLUMN(D67:BA67)-COLUMN(D67)+1, \"\"))","v":"1; 2; 3; 4; 8; 9; 12; 15; 16; 17"}]
[19,null,null,{"$f":"IF(COUNTA($D27:$BA27)=0,\"\",IF(COLUMN()-COLUMN($D$8)+1>$BB$8,IF(TRIM(D27)=\"\",\"\",IF(D27=D$8,1,0)),IF(D27=D$8,1,0)))","v":0},0,0,0,1,1,1,0,0,1,1,0,1,1,0,0,0,1,1,1,"","","","","","","","","","","","","","","","","","","","","","","","","","","","","","",{"$f":"_xlfn.TEXTJOIN(\"; \", TRUE, IF(D68:BA68=0, COLUMN(D68:BA68)-COLUMN(D68)+1, \"\"))","v":"1; 2; 3; 4; 8; 9; 12; 15; 16; 17"}]
[20,null,null,{"$f":"IF(COUNTA($D28:$BA28)=0,\"\",IF(COLUMN()-COLUMN($D$8)+1>$BB$8,IF(TRIM(D28)=\"\",\"\",IF(D28=D$8,1,0)),IF(D28=D$8,1,0)))","v":0},0,0,0,1,1,1,0,0,0,1,0,1,1,0,0,0,1,1,1,"","","","","","","","","","","","","","","","","","","","","","","","","","","","","","",{"$f":"_xlfn.TEXTJOIN(\"; \", TRUE, IF(D69:BA69=0, COLUMN(D69:BA69)-COLUMN(D69)+1, \"\"))","v":"1; 2; 3; 4; 8; 9; 10; 12; 15; 16; 17"}]
[21,null,null,{"$f":"IF(COUNTA($D29:$BA29)=0,\"\",IF(COLUMN()-COLUMN($D$8)+1>$BB$8,IF(TRIM(D29)=\"\",\"\",IF(D29=D$8,1,0)),IF(D29=D$8,1,0)))","v":0},1,1,0,1,1,1,1,0,1,1,0,1,1,1,1,1,1,1,1,"","","","","","","","","","","","","","","","","","","","","","","","","","","","","","",{"$f":"_xlfn.TEXTJOIN(\"; \", TRUE, IF(D70:BA70=0, COLUMN(D70:BA70)-COLUMN(D70)+1, \"\"))","v":"1; 4; 9; 12"}]
[22,null,null,{"$f":"IF(COUNTA($D30:$BA30)=0,\"\",IF(COLUMN()-COLUMN($D$8)+1>$BB$8,IF(TRIM(D30)=\"\",\"\",IF(D30=D$8,1,0)),IF(D30=D$8,1,0)))","v":0},1,1,0,1,1,1,0,0,1,1,0,1,1,0,0,0,1,1,1,"","","","","","","","","","","","","","","","","","","","","","","","","","","","","","",{"$f":"_xlfn.TEXTJOIN(\"; \", TRUE, IF(D71:BA71=0, COLUMN(D71:BA71)-COLUMN(D71)+1, \"\"))","v":"1; 4; 8; 9; 12; 15; 16; 17"}]
[23,null,null,{"$f":"IF(COUNTA($D31:$BA31)=0,\"\",IF(COLUMN()-COLUMN($D$8)+1>$BB$8,IF(TRIM(D31)=\"\",\"\",IF(D31=D$8,1,0)),IF(D31=D$8,1,0)))","v":0},0,0,0,1,1,1,0,0,0,1,0,1,1,0,1,1,1,1,1,"","","","","","","","","","","","","","","","","","","","","","","","","","","","","","",{"$f":"_xlfn.TEXTJOIN(\"; \", TRUE, IF(D72:BA72=0, COLUMN(D72:BA72)-COLUMN(D72)+1, \"\"))","v":"1; 2; 3; 4; 8; 9; 10; 12; 15"}]
[24,null,null,{"$f":"IF(COUNTA($D32:$BA32)=0,\"\",IF(COLUMN()-COLUMN($D$8)+1>$BB$8,IF(TRIM(D32)=\"\",\"\",IF(D32=D$8,1,0)),IF(D32=D$8,1,0)))","v":0},0,1,0,0,0,0,0,0,0,0,0,0,0,0,0,0,0,0,0,"","","","","","","","","","","","","","","","","","","","","","","","","","","","","","",{"$f":"_xlfn.TEXTJOIN(\"; \", TRUE, IF(D73:BA73=0, COLUMN(D73:BA73)-COLUMN(D73)+1, \"\"))","v":"1; 2; 4; 5; 6; 7; 8; 9; 10; 11; 12; 13; 14; 15; 16; 17; 18; 19; 20"}]
[25,null,null,{"$f":"IF(COUNTA($D33:$BA33)=0,\"\",IF(COLUMN()-COLUMN($D$8)+1>$BB$8,IF(TRIM(D33)=\"\",\"\",IF(D33=D$8,1,0)),IF(D33=D$8,1,0)))","v":""},"","","","","","","","","","","","","","","","","","","","","","","","","","","","","","","","","","","","","","","","","","","","","","","","","",{"$f":"_xlfn.TEXTJOIN(\"; \", TRUE, IF(D74:BA74=0, COLUMN(D74:BA74)-COLUMN(D74)+1, \"\"))","v":""}]
[26,null,null,{"$f":"IF(COUNTA($D34:$BA34)=0,\"\",IF(COLUMN()-COLUMN($D$8)+1>$BB$8,IF(TRIM(D34)=\"\",\"\",IF(D34=D$8,1,0)),IF(D34=D$8,1,0)))","v":""},"","","","","","","","","","","","","","","","","","","","","","","","","","","","","","","","","","","","","","","","","","","","","","","","","",{"$f":"_xlfn.TEXTJOIN(\"; \", TRUE, IF(D75:BA75=0, COLUMN(D75:BA75)-COLUMN(D75)+1, \"\"))","v":""}]
[27,null,null,{"$f":"IF(COUNTA($D35:$BA35)=0,\"\",IF(COLUMN()-COLUMN($D$8)+1>$BB$8,IF(TRIM(D35)=\"\",\"\",IF(D35=D$8,1,0)),IF(D35=D$8,1,0)))","v":""},"","","","","","","","","","","","","","","","","","","","","","","","","","","","","","","","","","","","","","","","","","","","","","","","","",{"$f":"_xlfn.TEXTJOIN(\"; \", TRUE, IF(D76:BA76=0, COLUMN(D76:BA76)-COLUMN(D76)+1, \"\"))","v":""}]
[28,null,null,{"$f":"IF(COUNTA($D36:$BA36)=0,\"\",IF(COLUMN()-COLUMN($D$8)+1>$BB$8,IF(TRIM(D36)=\"\",\"\",IF(D36=D$8,1,0)),IF(D36=D$8,1,0)))","v":""},"","","","","","","","","","","","","","","","","","","","","","","","","","","","","","","","","","","","","","","","","","","","","","","","","",{"$f":"_xlfn.TEXTJOIN(\"; \", TRUE, IF(D77:BA77=0, COLUMN(D77:BA77)-COLUMN(D77)+1, \"\"))","v":""}]
[29,null,null,{"$f":"IF(COUNTA($D37:$BA37)=0,\"\",IF(COLUMN()-COLUMN($D$8)+1>$BB$8,IF(TRIM(D37)=\"\",\"\",IF(D37=D$8,1,0)),IF(D37=D$8,1,0)))","v":""},"","","","","","","","","","","","","","","","","","","","","","","","","","","","","","","","","","","","","","","","","","","","","","","","","",{"$f":"_xlfn.TEXTJOIN(\"; \", TRUE, IF(D78:BA78=0, COLUMN(D78:BA78)-COLUMN(D78)+1, \"\"))","v":""}]
[30,null,null,{"$f":"IF(COUNTA($D38:$BA38)=0,\"\",IF(COLUMN()-COLUMN($D$8)+1>$BB$8,IF(TRIM(D38)=\"\",\"\",IF(D38=D$8,1,0)),IF(D38=D$8,1,0)))","v":""},"","","","","","","","","","","","","","","","","","","","","","","","","","","","","","","","","","","","","","","","","","","","","","","","","",{"$f":"_xlfn.TEXTJOIN(\"; \", TRUE, IF(D79:BA79=0, COLUMN(D79:BA79)-COLUMN(D79)+1, \"\"))","v":""}]
[31,null,null,{"$f":"IF(COUNTA($D39:$BA39)=0,\"\",IF(COLUMN()-COLUMN($D$8)+1>$BB$8,IF(TRIM(D39)=\"\",\"\",IF(D39=D$8,1,0)),IF(D39=D$8,1,0)))","v":""},"","","","","","","","","","","","","","","","","","","","","","","","","","","","","","","","","","","","","","","","","","","","","","","","","",{"$f":"_xlfn.TEXTJOIN(\"; \", TRUE, IF(D80:BA80=0, COLUMN(D80:BA80)-COLUMN(D80)+1, \"\"))","v":""}]
[32,null,null,{"$f":"IF(COUNTA($D40:$BA40)=0,\"\",IF(COLUMN()-COLUMN($D$8)+1>$BB$8,IF(TRIM(D40)=\"\",\"\",IF(D40=D$8,1,0)),IF(D40=D$8,1,0)))","v":""},"","","","","","","","","","","","","","","","","","","","","","","","","","","","","","","","","","","","","","","","","","","","","","","","","",{"$f":"_xlfn.TEXTJOIN(\"; \", TRUE, IF(D81:BA81=0, COLUMN(D81:BA81)-COLUMN(D81)+1, \"\"))","v":""}]
[33,null,null,{"$f":"IF(COUNTA($D41:$BA41)=0,\"\",IF(COLUMN()-COLUMN($D$8)+1>$BB$8,IF(TRIM(D41)=\"\",\"\",IF(D41=D$8,1,0)),IF(D41=D$8,1,0)))","v":""},"","","","","","","","","","","","","","","","","","","","","","","","","","","","","","","","","","","","","","","","","","","","","","","","","",{"$f":"_xlfn.TEXTJOIN(\"; \", TRUE, IF(D82:BA82=0, COLUMN(D82:BA82)-COLUMN(D82)+1, \"\"))","v":""}]
[34,null,null,{"$f":"IF(COUNTA($D42:$BA42)=0,\"\",IF(COLUMN()-COLUMN($D$8)+1>$BB$8,IF(TRIM(D42)=\"\",\"\",IF(D42=D$8,1,0)),IF(D42=D$8,1,0)))","v":""},"","","","","","","","","","","","","","","","","","","","","","","","","","","","","","","","","","","","","","","","","","","","","","","","","",{"$f":"_xlfn.TEXTJOIN(\"; \", TRUE, IF(D83:BA83=0, COLUMN(D83:BA83)-COLUMN(D83)+1, \"\"))","v":""}]
[35,null,null,{"$f":"IF(COUNTA($D43:$BA43)=0,\"\",IF(COLUMN()-COLUMN($D$8)+1>$BB$8,IF(TRIM(D43)=\"\",\"\",IF(D43=D$8,1,0)),IF(D43=D$8,1,0)))","v":""},"","","","","","","","","","","","","","","","","","","","","","","","","","","","","","","","","","","","","","","","","","","","","","","","","",{"$f":"_xlfn.TEXTJOIN(\"; \", TRUE, IF(D84:BA84=0, COLUMN(D84:BA84)-COLUMN(D84)+1, \"\"))","v":""}]
[36,null,null,{"$f":"IF(COUNTA($D44:$BA44)=0,\"\",IF(COLUMN()-COLUMN($D$8)+1>$BB$8,IF(TRIM(D44)=\"\",\"\",IF(D44=D$8,1,0)),IF(D44=D$8,1,0)))","v":""},"","","","","","","","","","","","","","","","","","","","","","","","","","","","","","","","","","","","","","","","","","","","","","","","","",{"$f":"_xlfn.TEXTJOIN(\"; \", TRUE, IF(D85:BA85=0, COLUMN(D85:BA85)-COLUMN(D85)+1, \"\"))","v":""}]
[37,null,null,{"$f":"IF(COUNTA($D45:$BA45)=0,\"\",IF(COLUMN()-COLUMN($D$8)+1>$BB$8,IF(TRIM(D45)=\"\",\"\",IF(D45=D$8,1,0)),IF(D45=D$8,1,0)))","v":""},"","","","","","","","","","","","","","","","","","","","","","","","","","","","","","","","","","","","","","","","","","","","","","","","","",{"$f":"_xlfn.TEXTJOIN(\"; \", TRUE, IF(D86:BA86=0, COLUMN(D86:BA86)-COLUMN(D86)+1, \"\"))","v":""}]
[38,null,null,{"$f":"IF(COUNTA($D46:$BA46)=0,\"\",IF(COLUMN()-COLUMN($D$8)+1>$BB$8,IF(TRIM(D46)=\"\",\"\",IF(D46=D$8,1,0)),IF(D46=D$8,1,0)))","v":""},"","","","","","","","","","","","","","","","","","","","","","","","","","","","","","","","","","","","","","","","","","","","","","","","","",{"$f":"_xlfn.TEXTJOIN(\"; \", TRUE, IF(D87:BA87=0, COLUMN(D87:BA87)-COLUMN(D87)+1, \"\"))","v":""}]
[39,null,null,{"$f":"IF(COUNTA($D47:$BA47)=0,\"\",IF(COLUMN()-COLUMN($D$8)+1>$BB$8,IF(TRIM(D47)=\"\",\"\",IF(D47=D$8,1,0)),IF(D47=D$8,1,0)))","v":""},"","","","","","","","","","","","","","","","","","","","","","","","","","","","","","","","","","","","","","","","","","","","","","","","","",{"$f":"_xlfn.TEXTJOIN(\"; \", TRUE, IF(D88:BA88=0, COLUMN(D88:BA88)-COLUMN(D88)+1, \"\"))","v":""}]
[40,null,null,{"$f":"IF(COUNTA($D48:$BA48)=0,\"\",IF(COLUMN()-COLUMN($D$8)+1>$BB$8,IF(TRIM(D48)=\"\",\"\",IF(D48=D$8,1,0)),IF(D48=D$8,1,0)))","v":""},"","","","","","","","","","","","","","","","","","","","","","","","","","","","","","","","","","","","","","","","","","","","","","","","","",{"$f":"_xlfn.TEXTJOIN(\"; \", TRUE, IF(D89:BA89=0, COLUMN(D89:BA89)-COLUMN(D89)+1, \"\"))","v":""}]
[null,null,"Max",{"$f":"IF(COUNT(D97:D136)=0,\"\",MAX(IF(D97:D136<>\"\",D97:D136)))","v":0},{"$f":"IF(COUNT(E97:E136)=0,\"\",MAX(IF(E97:E136<>\"\",E97:E136)))","v":5},{"$f":"IF(COUNT(F97:F136)=0,\"\",MAX(IF(F97:F136<>\"\",F97:F136)))","v":5},{"$f":"IF(COUNT(G97:G136)=0,\"\",MAX(IF(G97:G136<>\"\",G97:G136)))","v":5},{"$f":"IF(COUNT(H97:H136)=0,\"\",MAX(IF(H97:H136<>\"\",H97:H136)))","v":5},{"$f":"IF(COUNT(I97:I136)=0,\"\",MAX(IF(I97:I136<>\"\",I97:I136)))","v":5},{"$f":"IF(COUNT(J97:J136)=0,\"\",MAX(IF(J97:J136<>\"\",J97:J136)))","v":5},{"$f":"IF(COUNT(K97:K136)=0,\"\",MAX(IF(K97:K136<>\"\",K97:K136)))","v":5},{"$f":"IF(COUNT(L97:L136)=0,\"\",MAX(IF(L97:L136<>\"\",L97:L136)))","v":0},{"$f":"IF(COUNT(M97:M136)=0,\"\",MAX(IF(M97:M136<>\"\",M97:M136)))","v":5},{"$f":"IF(COUNT(N97:N136)=0,\"\",MAX(IF(N97:N136<>\"\",N97:N136)))","v":5},{"$f":"IF(COUNT(O97:O136)=0,\"\",MAX(IF(O97:O136<>\"\",O97:O136)))","v":0},{"$f":"IF(COUNT(P97:P136)=0,\"\",MAX(IF(P97:P136<>\"\",P97:P136)))","v":5},{"$f":"IF(COUNT(Q97:Q136)=0,\"\",MAX(IF(Q97:Q136<>\"\",Q97:Q136)))","v":5},{"$f":"IF(COUNT(R97:R136)=0,\"\",MAX(IF(R97:R136<>\"\",R97:R136)))","v":5},{"$f":"IF(COUNT(S97:S136)=0,\"\",MAX(IF(S97:S136<>\"\",S97:S136)))","v":5},{"$f":"IF(COUNT(T97:T136)=0,\"\",MAX(IF(T97:T136<>\"\",T97:T136)))","v":5},{"$f":"IF(COUNT(U97:U136)=0,\"\",MAX(IF(U97:U136<>\"\",U97:U136)))","v":5},{"$f":"IF(COUNT(V97:V136)=0,\"\",MAX(IF(V97:V136<>\"\",V97:V136)))","v":5},{"$f":"IF(COUNT(W97:W136)=0,\"\",MAX(IF(W97:W136<>\"\",W97:W136)))","v":5},{"$f":"IF(COUNT(X97:X136)=0,\"\",MAX(IF(X97:X136<>\"\",X97:X136)))","v":""},{"$f":"IF(COUNT(Y97:Y136)=0,\"\",MAX(IF(Y97:Y136<>\"\",Y97:Y136)))","v":""},{"$f":"IF(COUNT(Z97:Z136)=0,\"\",MAX(IF(Z97:Z136<>\"\",Z97:Z136)))","v":""},{"$f":"IF(COUNT(AA97:AA136)=0,\"\",MAX(IF(AA97:AA136<>\"\",AA97:AA136)))","v":""},{"$f":"IF(COUNT(AB97:AB136)=0,\"\",MAX(IF(AB97:AB136<>\"\",AB97:AB136)))","v":""},{"$f":"IF(COUNT(AC97:AC136)=0,\"\",MAX(IF(AC97:AC136<>\"\",AC97:AC136)))","v":""},{"$f":"IF(COUNT(AD97:AD136)=0,\"\",MAX(IF(AD97:AD136<>\"\",AD97:AD136)))","v":""},{"$f":"IF(COUNT(AE97:AE136)=0,\"\",MAX(IF(AE97:AE136<>\"\",AE97:AE136)))","v":""},{"$f":"IF(COUNT(AF97:AF136)=0,\"\",MAX(IF(AF97:AF136<>\"\",AF97:AF136)))","v":""},{"$f":"IF(COUNT(AG97:AG136)=0,\"\",MAX(IF(AG97:AG136<>\"\",AG97:AG136)))","v":""},{"$f":"IF(COUNT(AH97:AH136)=0,\"\",MAX(IF(AH97:AH136<>\"\",AH97:AH136)))","v":""},{"$f":"IF(COUNT(AI97:AI136)=0,\"\",MAX(IF(AI97:AI136<>\"\",AI97:AI136)))","v":""},{"$f":"IF(COUNT(AJ97:AJ136)=0,\"\",MAX(IF(AJ97:AJ136<>\"\",AJ97:AJ136)))","v":""},{"$f":"IF(COUNT(AK97:AK136)=0,\"\",MAX(IF(AK97:AK136<>\"\",AK97:AK136)))","v":""},{"$f":"IF(COUNT(AL97:AL136)=0,\"\",MAX(IF(AL97:AL136<>\"\",AL97:AL136)))","v":""},{"$f":"IF(COUNT(AM97:AM136)=0,\"\",MAX(IF(AM97:AM136<>\"\",AM97:AM136)))","v":""},{"$f":"IF(COUNT(AN97:AN136)=0,\"\",MAX(IF(AN97:AN136<>\"\",AN97:AN136)))","v":""},{"$f":"IF(COUNT(AO97:AO136)=0,\"\",MAX(IF(AO97:AO136<>\"\",AO97:AO136)))","v":""},{"$f":"IF(COUNT(AP97:AP136)=0,\"\",MAX(IF(AP97:AP136<>\"\",AP97:AP136)))","v":""},{"$f":"IF(COUNT(AQ97:AQ136)=0,\"\",MAX(IF(AQ97:AQ136<>\"\",AQ97:AQ136)))","v":""},{"$f":"IF(COUNT(AR97:AR136)=0,\"\",MAX(IF(AR97:AR136<>\"\",AR97:AR136)))","v":""},{"$f":"IF(COUNT(AS97:AS136)=0,\"\",MAX(IF(AS97:AS136<>\"\",AS97:AS136)))","v":""},{"$f":"IF(COUNT(AT97:AT136)=0,\"\",MAX(IF(AT97:AT136<>\"\",AT97:AT136)))","v":""},{"$f":"IF(COUNT(AU97:AU136)=0,\"\",MAX(IF(AU97:AU136<>\"\",AU97:AU136)))","v":""},{"$f":"IF(COUNT(AV97:AV136)=0,\"\",MAX(IF(AV97:AV136<>\"\",AV97:AV136)))","v":""},{"$f":"IF(COUNT(AW97:AW136)=0,\"\",MAX(IF(AW97:AW136<>\"\",AW97:AW136)))","v":""},{"$f":"IF(COUNT(AX97:AX136)=0,\"\",MAX(IF(AX97:AX136<>\"\",AX97:AX136)))","v":""},{"$f":"IF(COUNT(AY97:AY136)=0,\"\",MAX(IF(AY97:AY136<>\"\",AY97:AY136)))","v":""},{"$f":"IF(COUNT(AZ97:AZ136)=0,\"\",MAX(IF(AZ97:AZ136<>\"\",AZ97:AZ136)))","v":""},{"$f":"IF(COUNT(BA97:BA136)=0,\"\",MAX(IF(BA97:BA136<>\"\",BA97:BA136)))","v":""}]
[null,null,"Min",{"$f":"IF(COUNT(D50:D89)=0,\"\",MIN(IF(D50:D89<>\"\",D50:D89)))","v":0},{"$f":"IF(COUNT(E50:E89)=0,\"\",MIN(IF(E50:E89<>\"\",E50:E89)))","v":0},{"$f":"IF(COUNT(F50:F89)=0,\"\",MIN(IF(F50:F89<>\"\",F50:F89)))","v":0},{"$f":"IF(COUNT(G50:G89)=0,\"\",MIN(IF(G50:G89<>\"\",G50:G89)))","v":0},{"$f":"IF(COUNT(H50:H89)=0,\"\",MIN(IF(H50:H89<>\"\",H50:H89)))","v":0},{"$f":"IF(COUNT(I50:I89)=0,\"\",MIN(IF(I50:I89<>\"\",I50:I89)))","v":0},{"$f":"IF(COUNT(J50:J89)=0,\"\",MIN(IF(J50:J89<>\"\",J50:J89)))","v":0},{"$f":"IF(COUNT(K50:K89)=0,\"\",MIN(IF(K50:K89<>\"\",K50:K89)))","v":0},{"$f":"IF(COUNT(L50:L89)=0,\"\",MIN(IF(L50:L89<>\"\",L50:L89)))","v":0},{"$f":"IF(COUNT(M50:M89)=0,\"\",MIN(IF(M50:M89<>\"\",M50:M89)))","v":0},{"$f":"IF(COUNT(N50:N89)=0,\"\",MIN(IF(N50:N89<>\"\",N50:N89)))","v":0},{"$f":"IF(COUNT(O50:O89)=0,\"\",MIN(IF(O50:O89<>\"\",O50:O89)))","v":0},{"$f":"IF(COUNT(P50:P89)=0,\"\",MIN(IF(P50:P89<>\"\",P50:P89)))","v":0},{"$f":"IF(COUNT(Q50:Q89)=0,\"\",MIN(IF(Q50:Q89<>\"\",Q50:Q89)))","v":0},{"$f":"IF(COUNT(R50:R89)=0,\"\",MIN(IF(R50:R89<>\"\",R50:R89)))","v":0},{"$f":"IF(COUNT(S50:S89)=0,\"\",MIN(IF(S50:S89<>\"\",S50:S89)))","v":0},{"$f":"IF(COUNT(T50:T89)=0,\"\",MIN(IF(T50:T89<>\"\",T50:T89)))","v":0},{"$f":"IF(COUNT(U50:U89)=0,\"\",MIN(IF(U50:U89<>\"\",U50:U89)))","v":0},{"$f":"IF(COUNT(V50:V89)=0,\"\",MIN(IF(V50:V89<>\"\",V50:V89)))","v":0},{"$f":"IF(COUNT(W50:W89)=0,\"\",MIN(IF(W50:W89<>\"\",W50:W89)))","v":0},{"$f":"IF(COUNT(X50:X89)=0,\"\",MIN(IF(X50:X89<>\"\",X50:X89)))","v":""},{"$f":"IF(COUNT(Y50:Y89)=0,\"\",MIN(IF(Y50:Y89<>\"\",Y50:Y89)))","v":""},{"$f":"IF(COUNT(Z50:Z89)=0,\"\",MIN(IF(Z50:Z89<>\"\",Z50:Z89)))","v":""},{"$f":"IF(COUNT(AA50:AA89)=0,\"\",MIN(IF(AA50:AA89<>\"\",AA50:AA89)))","v":""},{"$f":"IF(COUNT(AB50:AB89)=0,\"\",MIN(IF(AB50:AB89<>\"\",AB50:AB89)))","v":""},{"$f":"IF(COUNT(AC50:AC89)=0,\"\",MIN(IF(AC50:AC89<>\"\",AC50:AC89)))","v":""},{"$f":"IF(COUNT(AD50:AD89)=0,\"\",MIN(IF(AD50:AD89<>\"\",AD50:AD89)))","v":""},{"$f":"IF(COUNT(AE50:AE89)=0,\"\",MIN(IF(AE50:AE89<>\"\",AE50:AE89)))","v":""},{"$f":"IF(COUNT(AF50:AF89)=0,\"\",MIN(IF(AF50:AF89<>\"\",AF50:AF89)))","v":""},{"$f":"IF(COUNT(AG50:AG89)=0,\"\",MIN(IF(AG50:AG89<>\"\",AG50:AG89)))","v":""},{"$f":"IF(COUNT(AH50:AH89)=0,\"\",MIN(IF(AH50:AH89<>\"\",AH50:AH89)))","v":""},{"$f":"IF(COUNT(AI50:AI89)=0,\"\",MIN(IF(AI50:AI89<>\"\",AI50:AI89)))","v":""},{"$f":"IF(COUNT(AJ50:AJ89)=0,\"\",MIN(IF(AJ50:AJ89<>\"\",AJ50:AJ89)))","v":""},{"$f":"IF(COUNT(AK50:AK89)=0,\"\",MIN(IF(AK50:AK89<>\"\",AK50:AK89)))","v":""},{"$f":"IF(COUNT(AL50:AL89)=0,\"\",MIN(IF(AL50:AL89<>\"\",AL50:AL89)))","v":""},{"$f":"IF(COUNT(AM50:AM89)=0,\"\",MIN(IF(AM50:AM89<>\"\",AM50:AM89)))","v":""},{"$f":"IF(COUNT(AN50:AN89)=0,\"\",MIN(IF(AN50:AN89<>\"\",AN50:AN89)))","v":""},{"$f":"IF(COUNT(AO50:AO89)=0,\"\",MIN(IF(AO50:AO89<>\"\",AO50:AO89)))","v":""},{"$f":"IF(COUNT(AP50:AP89)=0,\"\",MIN(IF(AP50:AP89<>\"\",AP50:AP89)))","v":""},{"$f":"IF(COUNT(AQ50:AQ89)=0,\"\",MIN(IF(AQ50:AQ89<>\"\",AQ50:AQ89)))","v":""},{"$f":"IF(COUNT(AR50:AR89)=0,\"\",MIN(IF(AR50:AR89<>\"\",AR50:AR89)))","v":""},{"$f":"IF(COUNT(AS50:AS89)=0,\"\",MIN(IF(AS50:AS89<>\"\",AS50:AS89)))","v":""},{"$f":"IF(COUNT(AT50:AT89)=0,\"\",MIN(IF(AT50:AT89<>\"\",AT50:AT89)))","v":""},{"$f":"IF(COUNT(AU50:AU89)=0,\"\",MIN(IF(AU50:AU89<>\"\",AU50:AU89)))","v":""},{"$f":"IF(COUNT(AV50:AV89)=0,\"\",MIN(IF(AV50:AV89<>\"\",AV50:AV89)))","v":""},{"$f":"IF(COUNT(AW50:AW89)=0,\"\",MIN(IF(AW50:AW89<>\"\",AW50:AW89)))","v":""},{"$f":"IF(COUNT(AX50:AX89)=0,\"\",MIN(IF(AX50:AX89<>\"\",AX50:AX89)))","v":""},{"$f":"IF(COUNT(AY50:AY89)=0,\"\",MIN(IF(AY50:AY89<>\"\",AY50:AY89)))","v":""},{"$f":"IF(COUNT(AZ50:AZ89)=0,\"\",MIN(IF(AZ50:AZ89<>\"\",AZ50:AZ89)))","v":""},{"$f":"IF(COUNT(BA50:BA89)=0,\"\",MIN(IF(BA50:BA89<>\"\",BA50:BA89)))","v":""}]
[null,null,"Tk. Kesukaran",{"$f":"IF(COUNT(D50:D89)=0,\"\",AVERAGEIF(D50:D89,\"<>\"))","v":0},{"$f":"IF(COUNT(E50:E89)=0,\"\",AVERAGEIF(E50:E89,\"<>\"))","v":0.52173913043478259},0.60869565217391308,0.21739130434782608,0.95652173913043481,0.95652173913043481,0.91304347826086951,0.47826086956521741,0,0.52173913043478259,0.73913043478260865,0,0.95652173913043481,0.91304347826086951,0.39130434782608697,0.30434782608695654,0.13043478260869565,0.86956521739130432,0.91304347826086951,0.95652173913043481,"","","","","","","","","","","","","","","","","","","","","","","","","","","","","",""]
[null,null,"Daya Beda",{"$f":"IF(\n    COUNTA(JAWABAN_PG!D9:D48)=0,\n    \"\",\n    (\n        COUNTIFS(\n            JAWABAN_PG!D9:D48, JAWABAN_PG!D8,\n            JAWABAN_PG!D50:D89, \">=\" & LARGE(JAWABAN_PG!D50:D89, $A$1)\n        )\n        -\n        COUNTIFS(\n            JAWABAN_PG!D9:D48, JAWABAN_PG!D8,\n            JAWABAN_PG!D50:D89, \"<=\" & SMALL(JAWABAN_PG!D50:D89, $A$1)\n        )\n    ) / $A$1\n)","v":0},{"$f":"IF(\n    COUNTA(JAWABAN_PG!E9:E48)=0,\n    \"\",\n    (\n        COUNTIFS(\n            JAWABAN_PG!E9:E48, JAWABAN_PG!E8,\n            JAWABAN_PG!E50:E89, \">=\" & LARGE(JAWABAN_PG!E50:E89, $A$1)\n        )\n        -\n        COUNTIFS(\n            JAWABAN_PG!E9:E48, JAWABAN_PG!E8,\n            JAWABAN_PG!E50:E89, \"<=\" & SMALL(JAWABAN_PG!E50:E89, $A$1)\n        )\n    ) / $A$1\n)","v":2},{"$f":"IF(\n    COUNTA(JAWABAN_PG!F9:F48)=0,\n    \"\",\n    (\n        COUNTIFS(\n            JAWABAN_PG!F9:F48, JAWABAN_PG!F8,\n            JAWABAN_PG!F50:F89, \">=\" & LARGE(JAWABAN_PG!F50:F89, $A$1)\n        )\n        -\n        COUNTIFS(\n            JAWABAN_PG!F9:F48, JAWABAN_PG!F8,\n            JAWABAN_PG!F50:F89, \"<=\" & SMALL(JAWABAN_PG!F50:F89, $A$1)\n        )\n    ) / $A$1\n)","v":2.3333333333333335},{"$f":"IF(\n    COUNTA(JAWABAN_PG!G9:G48)=0,\n    \"\",\n    (\n        COUNTIFS(\n            JAWABAN_PG!G9:G48, JAWABAN_PG!G8,\n            JAWABAN_PG!G50:G89, \">=\" & LARGE(JAWABAN_PG!G50:G89, $A$1)\n        )\n        -\n        COUNTIFS(\n            JAWABAN_PG!G9:G48, JAWABAN_PG!G8,\n            JAWABAN_PG!G50:G89, \"<=\" & SMALL(JAWABAN_PG!G50:G89, $A$1)\n        )\n    ) / $A$1\n)","v":0.83333333333333337},{"$f":"IF(\n    COUNTA(JAWABAN_PG!H9:H48)=0,\n    \"\",\n    (\n        COUNTIFS(\n            JAWABAN_PG!H9:H48, JAWABAN_PG!H8,\n            JAWABAN_PG!H50:H89, \">=\" & LARGE(JAWABAN_PG!H50:H89, $A$1)\n        )\n        -\n        COUNTIFS(\n            JAWABAN_PG!H9:H48, JAWABAN_PG!H8,\n            JAWABAN_PG!H50:H89, \"<=\" & SMALL(JAWABAN_PG!H50:H89, $A$1)\n        )\n    ) / $A$1\n)","v":0},{"$f":"IF(\n    COUNTA(JAWABAN_PG!I9:I48)=0,\n    \"\",\n    (\n        COUNTIFS(\n            JAWABAN_PG!I9:I48, JAWABAN_PG!I8,\n            JAWABAN_PG!I50:I89, \">=\" & LARGE(JAWABAN_PG!I50:I89, $A$1)\n        )\n        -\n        COUNTIFS(\n            JAWABAN_PG!I9:I48, JAWABAN_PG!I8,\n            JAWABAN_PG!I50:I89, \"<=\" & SMALL(JAWABAN_PG!I50:I89, $A$1)\n        )\n    ) / $A$1\n)","v":0},{"$f":"IF(\n    COUNTA(JAWABAN_PG!J9:J48)=0,\n    \"\",\n    (\n        COUNTIFS(\n            JAWABAN_PG!J9:J48, JAWABAN_PG!J8,\n            JAWABAN_PG!J50:J89, \">=\" & LARGE(JAWABAN_PG!J50:J89, $A$1)\n        )\n        -\n        COUNTIFS(\n            JAWABAN_PG!J9:J48, JAWABAN_PG!J8,\n            JAWABAN_PG!J50:J89, \"<=\" & SMALL(JAWABAN_PG!J50:J89, $A$1)\n        )\n    ) / $A$1\n)","v":0},{"$f":"IF(\n    COUNTA(JAWABAN_PG!K9:K48)=0,\n    \"\",\n    (\n        COUNTIFS(\n            JAWABAN_PG!K9:K48, JAWABAN_PG!K8,\n            JAWABAN_PG!K50:K89, \">=\" & LARGE(JAWABAN_PG!K50:K89, $A$1)\n        )\n        -\n        COUNTIFS(\n            JAWABAN_PG!K9:K48, JAWABAN_PG!K8,\n            JAWABAN_PG!K50:K89, \"<=\" & SMALL(JAWABAN_PG!K50:K89, $A$1)\n        )\n    ) / $A$1\n)","v":1.8333333333333333},{"$f":"IF(\n    COUNTA(JAWABAN_PG!L9:L48)=0,\n    \"\",\n    (\n        COUNTIFS(\n            JAWABAN_PG!L9:L48, JAWABAN_PG!L8,\n            JAWABAN_PG!L50:L89, \">=\" & LARGE(JAWABAN_PG!L50:L89, $A$1)\n        )\n        -\n        COUNTIFS(\n            JAWABAN_PG!L9:L48, JAWABAN_PG!L8,\n            JAWABAN_PG!L50:L89, \"<=\" & SMALL(JAWABAN_PG!L50:L89, $A$1)\n        )\n    ) / $A$1\n)","v":0},{"$f":"IF(\n    COUNTA(JAWABAN_PG!M9:M48)=0,\n    \"\",\n    (\n        COUNTIFS(\n            JAWABAN_PG!M9:M48, JAWABAN_PG!M8,\n            JAWABAN_PG!M50:M89, \">=\" & LARGE(JAWABAN_PG!M50:M89, $A$1)\n        )\n        -\n        COUNTIFS(\n            JAWABAN_PG!M9:M48, JAWABAN_PG!M8,\n            JAWABAN_PG!M50:M89, \"<=\" & SMALL(JAWABAN_PG!M50:M89, $A$1)\n        )\n    ) / $A$1\n)","v":2},{"$f":"IF(\n    COUNTA(JAWABAN_PG!N9:N48)=0,\n    \"\",\n    (\n        COUNTIFS(\n            JAWABAN_PG!N9:N48, JAWABAN_PG!N8,\n            JAWABAN_PG!N50:N89, \">=\" & LARGE(JAWABAN_PG!N50:N89, $A$1)\n        )\n        -\n        COUNTIFS(\n            JAWABAN_PG!N9:N48, JAWABAN_PG!N8,\n            JAWABAN_PG!N50:N89, \"<=\" & SMALL(JAWABAN_PG!N50:N89, $A$1)\n        )\n    ) / $A$1\n)","v":2.8333333333333335},{"$f":"IF(\n    COUNTA(JAWABAN_PG!O9:O48)=0,\n    \"\",\n    (\n        COUNTIFS(\n            JAWABAN_PG!O9:O48, JAWABAN_PG!O8,\n            JAWABAN_PG!O50:O89, \">=\" & LARGE(JAWABAN_PG!O50:O89, $A$1)\n        )\n        -\n        COUNTIFS(\n            JAWABAN_PG!O9:O48, JAWABAN_PG!O8,\n            JAWABAN_PG!O50:O89, \"<=\" & SMALL(JAWABAN_PG!O50:O89, $A$1)\n        )\n    ) / $A$1\n)","v":0},{"$f":"IF(\n    COUNTA(JAWABAN_PG!P9:P48)=0,\n    \"\",\n    (\n        COUNTIFS(\n            JAWABAN_PG!P9:P48, JAWABAN_PG!P8,\n            JAWABAN_PG!P50:P89, \">=\" & LARGE(JAWABAN_PG!P50:P89, $A$1)\n        )\n        -\n        COUNTIFS(\n            JAWABAN_PG!P9:P48, JAWABAN_PG!P8,\n            JAWABAN_PG!P50:P89, \"<=\" & SMALL(JAWABAN_PG!P50:P89, $A$1)\n        )\n    ) / $A$1\n)","v":0},{"$f":"IF(\n    COUNTA(JAWABAN_PG!Q9:Q48)=0,\n    \"\",\n    (\n        COUNTIFS(\n            JAWABAN_PG!Q9:Q48, JAWABAN_PG!Q8,\n            JAWABAN_PG!Q50:Q89, \">=\" & LARGE(JAWABAN_PG!Q50:Q89, $A$1)\n        )\n        -\n        COUNTIFS(\n            JAWABAN_PG!Q9:Q48, JAWABAN_PG!Q8,\n            JAWABAN_PG!Q50:Q89, \"<=\" & SMALL(JAWABAN_PG!Q50:Q89, $A$1)\n        )\n    ) / $A$1\n)","v":0},{"$f":"IF(\n    COUNTA(JAWABAN_PG!R9:R48)=0,\n    \"\",\n    (\n        COUNTIFS(\n            JAWABAN_PG!R9:R48, JAWABAN_PG!R8,\n            JAWABAN_PG!R50:R89, \">=\" & LARGE(JAWABAN_PG!R50:R89, $A$1)\n        )\n        -\n        COUNTIFS(\n            JAWABAN_PG!R9:R48, JAWABAN_PG!R8,\n            JAWABAN_PG!R50:R89, \"<=\" & SMALL(JAWABAN_PG!R50:R89, $A$1)\n        )\n    ) / $A$1\n)","v":1.5},{"$f":"IF(\n    COUNTA(JAWABAN_PG!S9:S48)=0,\n    \"\",\n    (\n        COUNTIFS(\n            JAWABAN_PG!S9:S48, JAWABAN_PG!S8,\n            JAWABAN_PG!S50:S89, \">=\" & LARGE(JAWABAN_PG!S50:S89, $A$1)\n        )\n        -\n        COUNTIFS(\n            JAWABAN_PG!S9:S48, JAWABAN_PG!S8,\n            JAWABAN_PG!S50:S89, \"<=\" & SMALL(JAWABAN_PG!S50:S89, $A$1)\n        )\n    ) / $A$1\n)","v":1.1666666666666667},{"$f":"IF(\n    COUNTA(JAWABAN_PG!T9:T48)=0,\n    \"\",\n    (\n        COUNTIFS(\n            JAWABAN_PG!T9:T48, JAWABAN_PG!T8,\n            JAWABAN_PG!T50:T89, \">=\" & LARGE(JAWABAN_PG!T50:T89, $A$1)\n        )\n        -\n        COUNTIFS(\n            JAWABAN_PG!T9:T48, JAWABAN_PG!T8,\n            JAWABAN_PG!T50:T89, \"<=\" & SMALL(JAWABAN_PG!T50:T89, $A$1)\n        )\n    ) / $A$1\n)","v":0.5},{"$f":"IF(\n    COUNTA(JAWABAN_PG!U9:U48)=0,\n    \"\",\n    (\n        COUNTIFS(\n            JAWABAN_PG!U9:U48, JAWABAN_PG!U8,\n            JAWABAN_PG!U50:U89, \">=\" & LARGE(JAWABAN_PG!U50:U89, $A$1)\n        )\n        -\n        COUNTIFS(\n            JAWABAN_PG!U9:U48, JAWABAN_PG!U8,\n            JAWABAN_PG!U50:U89, \"<=\" & SMALL(JAWABAN_PG!U50:U89, $A$1)\n        )\n    ) / $A$1\n)","v":0},{"$f":"IF(\n    COUNTA(JAWABAN_PG!V9:V48)=0,\n    \"\",\n    (\n        COUNTIFS(\n            JAWABAN_PG!V9:V48, JAWABAN_PG!V8,\n            JAWABAN_PG!V50:V89, \">=\" & LARGE(JAWABAN_PG!V50:V89, $A$1)\n        )\n        -\n        COUNTIFS(\n            JAWABAN_PG!V9:V48, JAWABAN_PG!V8,\n            JAWABAN_PG!V50:V89, \"<=\" & SMALL(JAWABAN_PG!V50:V89, $A$1)\n        )\n    ) / $A$1\n)","v":0},{"$f":"IF(\n    COUNTA(JAWABAN_PG!W9:W48)=0,\n    \"\",\n    (\n        COUNTIFS(\n            JAWABAN_PG!W9:W48, JAWABAN_PG!W8,\n            JAWABAN_PG!W50:W89, \">=\" & LARGE(JAWABAN_PG!W50:W89, $A$1)\n        )\n        -\n        COUNTIFS(\n            JAWABAN_PG!W9:W48, JAWABAN_PG!W8,\n            JAWABAN_PG!W50:W89, \"<=\" & SMALL(JAWABAN_PG!W50:W89, $A$1)\n        )\n    ) / $A$1\n)","v":0},{"$f":"IF(\n    COUNTA(JAWABAN_PG!X9:X48)=0,\n    \"\",\n    (\n        COUNTIFS(\n            JAWABAN_PG!X9:X48, JAWABAN_PG!X8,\n            JAWABAN_PG!X50:X89, \">=\" & LARGE(JAWABAN_PG!X50:X89, $A$1)\n        )\n        -\n        COUNTIFS(\n            JAWABAN_PG!X9:X48, JAWABAN_PG!X8,\n            JAWABAN_PG!X50:X89, \"<=\" & SMALL(JAWABAN_PG!X50:X89, $A$1)\n        )\n    ) / $A$1\n)","v":""},{"$f":"IF(\n    COUNTA(JAWABAN_PG!Y9:Y48)=0,\n    \"\",\n    (\n        COUNTIFS(\n            JAWABAN_PG!Y9:Y48, JAWABAN_PG!Y8,\n            JAWABAN_PG!Y50:Y89, \">=\" & LARGE(JAWABAN_PG!Y50:Y89, $A$1)\n        )\n        -\n        COUNTIFS(\n            JAWABAN_PG!Y9:Y48, JAWABAN_PG!Y8,\n            JAWABAN_PG!Y50:Y89, \"<=\" & SMALL(JAWABAN_PG!Y50:Y89, $A$1)\n        )\n    ) / $A$1\n)","v":""},{"$f":"IF(\n    COUNTA(JAWABAN_PG!Z9:Z48)=0,\n    \"\",\n    (\n        COUNTIFS(\n            JAWABAN_PG!Z9:Z48, JAWABAN_PG!Z8,\n            JAWABAN_PG!Z50:Z89, \">=\" & LARGE(JAWABAN_PG!Z50:Z89, $A$1)\n        )\n        -\n        COUNTIFS(\n            JAWABAN_PG!Z9:Z48, JAWABAN_PG!Z8,\n            JAWABAN_PG!Z50:Z89, \"<=\" & SMALL(JAWABAN_PG!Z50:Z89, $A$1)\n        )\n    ) / $A$1\n)","v":""},{"$f":"IF(\n    COUNTA(JAWABAN_PG!AA9:AA48)=0,\n    \"\",\n    (\n        COUNTIFS(\n            JAWABAN_PG!AA9:AA48, JAWABAN_PG!AA8,\n            JAWABAN_PG!AA50:AA89, \">=\" & LARGE(JAWABAN_PG!AA50:AA89, $A$1)\n        )\n        -\n        COUNTIFS(\n            JAWABAN_PG!AA9:AA48, JAWABAN_PG!AA8,\n            JAWABAN_PG!AA50:AA89, \"<=\" & SMALL(JAWABAN_PG!AA50:AA89, $A$1)\n        )\n    ) / $A$1\n)","v":""},{"$f":"IF(\n    COUNTA(JAWABAN_PG!AB9:AB48)=0,\n    \"\",\n    (\n        COUNTIFS(\n            JAWABAN_PG!AB9:AB48, JAWABAN_PG!AB8,\n            JAWABAN_PG!AB50:AB89, \">=\" & LARGE(JAWABAN_PG!AB50:AB89, $A$1)\n        )\n        -\n        COUNTIFS(\n            JAWABAN_PG!AB9:AB48, JAWABAN_PG!AB8,\n            JAWABAN_PG!AB50:AB89, \"<=\" & SMALL(JAWABAN_PG!AB50:AB89, $A$1)\n        )\n    ) / $A$1\n)","v":""},{"$f":"IF(\n    COUNTA(JAWABAN_PG!AC9:AC48)=0,\n    \"\",\n    (\n        COUNTIFS(\n            JAWABAN_PG!AC9:AC48, JAWABAN_PG!AC8,\n            JAWABAN_PG!AC50:AC89, \">=\" & LARGE(JAWABAN_PG!AC50:AC89, $A$1)\n        )\n        -\n        COUNTIFS(\n            JAWABAN_PG!AC9:AC48, JAWABAN_PG!AC8,\n            JAWABAN_PG!AC50:AC89, \"<=\" & SMALL(JAWABAN_PG!AC50:AC89, $A$1)\n        )\n    ) / $A$1\n)","v":""},{"$f":"IF(\n    COUNTA(JAWABAN_PG!AD9:AD48)=0,\n    \"\",\n    (\n        COUNTIFS(\n            JAWABAN_PG!AD9:AD48, JAWABAN_PG!AD8,\n            JAWABAN_PG!AD50:AD89, \">=\" & LARGE(JAWABAN_PG!AD50:AD89, $A$1)\n        )\n        -\n        COUNTIFS(\n            JAWABAN_PG!AD9:AD48, JAWABAN_PG!AD8,\n            JAWABAN_PG!AD50:AD89, \"<=\" & SMALL(JAWABAN_PG!AD50:AD89, $A$1)\n        )\n    ) / $A$1\n)","v":""},{"$f":"IF(\n    COUNTA(JAWABAN_PG!AE9:AE48)=0,\n    \"\",\n    (\n        COUNTIFS(\n            JAWABAN_PG!AE9:AE48, JAWABAN_PG!AE8,\n            JAWABAN_PG!AE50:AE89, \">=\" & LARGE(JAWABAN_PG!AE50:AE89, $A$1)\n        )\n        -\n        COUNTIFS(\n            JAWABAN_PG!AE9:AE48, JAWABAN_PG!AE8,\n            JAWABAN_PG!AE50:AE89, \"<=\" & SMALL(JAWABAN_PG!AE50:AE89, $A$1)\n        )\n    ) / $A$1\n)","v":""},{"$f":"IF(\n    COUNTA(JAWABAN_PG!AF9:AF48)=0,\n    \"\",\n    (\n        COUNTIFS(\n            JAWABAN_PG!AF9:AF48, JAWABAN_PG!AF8,\n            JAWABAN_PG!AF50:AF89, \">=\" & LARGE(JAWABAN_PG!AF50:AF89, $A$1)\n        )\n        -\n        COUNTIFS(\n            JAWABAN_PG!AF9:AF48, JAWABAN_PG!AF8,\n            JAWABAN_PG!AF50:AF89, \"<=\" & SMALL(JAWABAN_PG!AF50:AF89, $A$1)\n        )\n    ) / $A$1\n)","v":""},{"$f":"IF(\n    COUNTA(JAWABAN_PG!AG9:AG48)=0,\n    \"\",\n    (\n        COUNTIFS(\n            JAWABAN_PG!AG9:AG48, JAWABAN_PG!AG8,\n            JAWABAN_PG!AG50:AG89, \">=\" & LARGE(JAWABAN_PG!AG50:AG89, $A$1)\n        )\n        -\n        COUNTIFS(\n            JAWABAN_PG!AG9:AG48, JAWABAN_PG!AG8,\n            JAWABAN_PG!AG50:AG89, \"<=\" & SMALL(JAWABAN_PG!AG50:AG89, $A$1)\n        )\n    ) / $A$1\n)","v":""},{"$f":"IF(\n    COUNTA(JAWABAN_PG!AH9:AH48)=0,\n    \"\",\n    (\n        COUNTIFS(\n            JAWABAN_PG!AH9:AH48, JAWABAN_PG!AH8,\n            JAWABAN_PG!AH50:AH89, \">=\" & LARGE(JAWABAN_PG!AH50:AH89, $A$1)\n        )\n        -\n        COUNTIFS(\n            JAWABAN_PG!AH9:AH48, JAWABAN_PG!AH8,\n            JAWABAN_PG!AH50:AH89, \"<=\" & SMALL(JAWABAN_PG!AH50:AH89, $A$1)\n        )\n    ) / $A$1\n)","v":""},{"$f":"IF(\n    COUNTA(JAWABAN_PG!AI9:AI48)=0,\n    \"\",\n    (\n        COUNTIFS(\n            JAWABAN_PG!AI9:AI48, JAWABAN_PG!AI8,\n            JAWABAN_PG!AI50:AI89, \">=\" & LARGE(JAWABAN_PG!AI50:AI89, $A$1)\n        )\n        -\n        COUNTIFS(\n            JAWABAN_PG!AI9:AI48, JAWABAN_PG!AI8,\n            JAWABAN_PG!AI50:AI89, \"<=\" & SMALL(JAWABAN_PG!AI50:AI89, $A$1)\n        )\n    ) / $A$1\n)","v":""},{"$f":"IF(\n    COUNTA(JAWABAN_PG!AJ9:AJ48)=0,\n    \"\",\n    (\n        COUNTIFS(\n            JAWABAN_PG!AJ9:AJ48, JAWABAN_PG!AJ8,\n            JAWABAN_PG!AJ50:AJ89, \">=\" & LARGE(JAWABAN_PG!AJ50:AJ89, $A$1)\n        )\n        -\n        COUNTIFS(\n            JAWABAN_PG!AJ9:AJ48, JAWABAN_PG!AJ8,\n            JAWABAN_PG!AJ50:AJ89, \"<=\" & SMALL(JAWABAN_PG!AJ50:AJ89, $A$1)\n        )\n    ) / $A$1\n)","v":""},{"$f":"IF(\n    COUNTA(JAWABAN_PG!AK9:AK48)=0,\n    \"\",\n    (\n        COUNTIFS(\n            JAWABAN_PG!AK9:AK48, JAWABAN_PG!AK8,\n            JAWABAN_PG!AK50:AK89, \">=\" & LARGE(JAWABAN_PG!AK50:AK89, $A$1)\n        )\n        -\n        COUNTIFS(\n            JAWABAN_PG!AK9:AK48, JAWABAN_PG!AK8,\n            JAWABAN_PG!AK50:AK89, \"<=\" & SMALL(JAWABAN_PG!AK50:AK89, $A$1)\n        )\n    ) / $A$1\n)","v":""},{"$f":"IF(\n    COUNTA(JAWABAN_PG!AL9:AL48)=0,\n    \"\",\n    (\n        COUNTIFS(\n            JAWABAN_PG!AL9:AL48, JAWABAN_PG!AL8,\n            JAWABAN_PG!AL50:AL89, \">=\" & LARGE(JAWABAN_PG!AL50:AL89, $A$1)\n        )\n        -\n        COUNTIFS(\n            JAWABAN_PG!AL9:AL48, JAWABAN_PG!AL8,\n            JAWABAN_PG!AL50:AL89, \"<=\" & SMALL(JAWABAN_PG!AL50:AL89, $A$1)\n        )\n    ) / $A$1\n)","v":""},{"$f":"IF(\n    COUNTA(JAWABAN_PG!AM9:AM48)=0,\n    \"\",\n    (\n        COUNTIFS(\n            JAWABAN_PG!AM9:AM48, JAWABAN_PG!AM8,\n            JAWABAN_PG!AM50:AM89, \">=\" & LARGE(JAWABAN_PG!AM50:AM89, $A$1)\n        )\n        -\n        COUNTIFS(\n            JAWABAN_PG!AM9:AM48, JAWABAN_PG!AM8,\n            JAWABAN_PG!AM50:AM89, \"<=\" & SMALL(JAWABAN_PG!AM50:AM89, $A$1)\n        )\n    ) / $A$1\n)","v":""},{"$f":"IF(\n    COUNTA(JAWABAN_PG!AN9:AN48)=0,\n    \"\",\n    (\n        COUNTIFS(\n            JAWABAN_PG!AN9:AN48, JAWABAN_PG!AN8,\n            JAWABAN_PG!AN50:AN89, \">=\" & LARGE(JAWABAN_PG!AN50:AN89, $A$1)\n        )\n        -\n        COUNTIFS(\n            JAWABAN_PG!AN9:AN48, JAWABAN_PG!AN8,\n            JAWABAN_PG!AN50:AN89, \"<=\" & SMALL(JAWABAN_PG!AN50:AN89, $A$1)\n        )\n    ) / $A$1\n)","v":""},{"$f":"IF(\n    COUNTA(JAWABAN_PG!AO9:AO48)=0,\n    \"\",\n    (\n        COUNTIFS(\n            JAWABAN_PG!AO9:AO48, JAWABAN_PG!AO8,\n            JAWABAN_PG!AO50:AO89, \">=\" & LARGE(JAWABAN_PG!AO50:AO89, $A$1)\n        )\n        -\n        COUNTIFS(\n            JAWABAN_PG!AO9:AO48, JAWABAN_PG!AO8,\n            JAWABAN_PG!AO50:AO89, \"<=\" & SMALL(JAWABAN_PG!AO50:AO89, $A$1)\n        )\n    ) / $A$1\n)","v":""},{"$f":"IF(\n    COUNTA(JAWABAN_PG!AP9:AP48)=0,\n    \"\",\n    (\n        COUNTIFS(\n            JAWABAN_PG!AP9:AP48, JAWABAN_PG!AP8,\n            JAWABAN_PG!AP50:AP89, \">=\" & LARGE(JAWABAN_PG!AP50:AP89, $A$1)\n        )\n        -\n        COUNTIFS(\n            JAWABAN_PG!AP9:AP48, JAWABAN_PG!AP8,\n            JAWABAN_PG!AP50:AP89, \"<=\" & SMALL(JAWABAN_PG!AP50:AP89, $A$1)\n        )\n    ) / $A$1\n)","v":""},{"$f":"IF(\n    COUNTA(JAWABAN_PG!AQ9:AQ48)=0,\n    \"\",\n    (\n        COUNTIFS(\n            JAWABAN_PG!AQ9:AQ48, JAWABAN_PG!AQ8,\n            JAWABAN_PG!AQ50:AQ89, \">=\" & LARGE(JAWABAN_PG!AQ50:AQ89, $A$1)\n        )\n        -\n        COUNTIFS(\n            JAWABAN_PG!AQ9:AQ48, JAWABAN_PG!AQ8,\n            JAWABAN_PG!AQ50:AQ89, \"<=\" & SMALL(JAWABAN_PG!AQ50:AQ89, $A$1)\n        )\n    ) / $A$1\n)","v":""},{"$f":"IF(\n    COUNTA(JAWABAN_PG!AR9:AR48)=0,\n    \"\",\n    (\n        COUNTIFS(\n            JAWABAN_PG!AR9:AR48, JAWABAN_PG!AR8,\n            JAWABAN_PG!AR50:AR89, \">=\" & LARGE(JAWABAN_PG!AR50:AR89, $A$1)\n        )\n        -\n        COUNTIFS(\n            JAWABAN_PG!AR9:AR48, JAWABAN_PG!AR8,\n            JAWABAN_PG!AR50:AR89, \"<=\" & SMALL(JAWABAN_PG!AR50:AR89, $A$1)\n        )\n    ) / $A$1\n)","v":""},{"$f":"IF(\n    COUNTA(JAWABAN_PG!AS9:AS48)=0,\n    \"\",\n    (\n        COUNTIFS(\n            JAWABAN_PG!AS9:AS48, JAWABAN_PG!AS8,\n            JAWABAN_PG!AS50:AS89, \">=\" & LARGE(JAWABAN_PG!AS50:AS89, $A$1)\n        )\n        -\n        COUNTIFS(\n            JAWABAN_PG!AS9:AS48, JAWABAN_PG!AS8,\n            JAWABAN_PG!AS50:AS89, \"<=\" & SMALL(JAWABAN_PG!AS50:AS89, $A$1)\n        )\n    ) / $A$1\n)","v":""},{"$f":"IF(\n    COUNTA(JAWABAN_PG!AT9:AT48)=0,\n    \"\",\n    (\n        COUNTIFS(\n            JAWABAN_PG!AT9:AT48, JAWABAN_PG!AT8,\n            JAWABAN_PG!AT50:AT89, \">=\" & LARGE(JAWABAN_PG!AT50:AT89, $A$1)\n        )\n        -\n        COUNTIFS(\n            JAWABAN_PG!AT9:AT48, JAWABAN_PG!AT8,\n            JAWABAN_PG!AT50:AT89, \"<=\" & SMALL(JAWABAN_PG!AT50:AT89, $A$1)\n        )\n    ) / $A$1\n)","v":""},{"$f":"IF(\n    COUNTA(JAWABAN_PG!AU9:AU48)=0,\n    \"\",\n    (\n        COUNTIFS(\n            JAWABAN_PG!AU9:AU48, JAWABAN_PG!AU8,\n            JAWABAN_PG!AU50:AU89, \">=\" & LARGE(JAWABAN_PG!AU50:AU89, $A$1)\n        )\n        -\n        COUNTIFS(\n            JAWABAN_PG!AU9:AU48, JAWABAN_PG!AU8,\n            JAWABAN_PG!AU50:AU89, \"<=\" & SMALL(JAWABAN_PG!AU50:AU89, $A$1)\n        )\n    ) / $A$1\n)","v":""},{"$f":"IF(\n    COUNTA(JAWABAN_PG!AV9:AV48)=0,\n    \"\",\n    (\n        COUNTIFS(\n            JAWABAN_PG!AV9:AV48, JAWABAN_PG!AV8,\n            JAWABAN_PG!AV50:AV89, \">=\" & LARGE(JAWABAN_PG!AV50:AV89, $A$1)\n        )\n        -\n        COUNTIFS(\n            JAWABAN_PG!AV9:AV48, JAWABAN_PG!AV8,\n            JAWABAN_PG!AV50:AV89, \"<=\" & SMALL(JAWABAN_PG!AV50:AV89, $A$1)\n        )\n    ) / $A$1\n)","v":""},{"$f":"IF(\n    COUNTA(JAWABAN_PG!AW9:AW48)=0,\n    \"\",\n    (\n        COUNTIFS(\n            JAWABAN_PG!AW9:AW48, JAWABAN_PG!AW8,\n            JAWABAN_PG!AW50:AW89, \">=\" & LARGE(JAWABAN_PG!AW50:AW89, $A$1)\n        )\n        -\n        COUNTIFS(\n            JAWABAN_PG!AW9:AW48, JAWABAN_PG!AW8,\n            JAWABAN_PG!AW50:AW89, \"<=\" & SMALL(JAWABAN_PG!AW50:AW89, $A$1)\n        )\n    ) / $A$1\n)","v":""},{"$f":"IF(\n    COUNTA(JAWABAN_PG!AX9:AX48)=0,\n    \"\",\n    (\n        COUNTIFS(\n            JAWABAN_PG!AX9:AX48, JAWABAN_PG!AX8,\n            JAWABAN_PG!AX50:AX89, \">=\" & LARGE(JAWABAN_PG!AX50:AX89, $A$1)\n        )\n        -\n        COUNTIFS(\n            JAWABAN_PG!AX9:AX48, JAWABAN_PG!AX8,\n            JAWABAN_PG!AX50:AX89, \"<=\" & SMALL(JAWABAN_PG!AX50:AX89, $A$1)\n        )\n    ) / $A$1\n)","v":""},{"$f":"IF(\n    COUNTA(JAWABAN_PG!AY9:AY48)=0,\n    \"\",\n    (\n        COUNTIFS(\n            JAWABAN_PG!AY9:AY48, JAWABAN_PG!AY8,\n            JAWABAN_PG!AY50:AY89, \">=\" & LARGE(JAWABAN_PG!AY50:AY89, $A$1)\n        )\n        -\n        COUNTIFS(\n            JAWABAN_PG!AY9:AY48, JAWABAN_PG!AY8,\n            JAWABAN_PG!AY50:AY89, \"<=\" & SMALL(JAWABAN_PG!AY50:AY89, $A$1)\n        )\n    ) / $A$1\n)","v":""},{"$f":"IF(\n    COUNTA(JAWABAN_PG!AZ9:AZ48)=0,\n    \"\",\n    (\n        COUNTIFS(\n            JAWABAN_PG!AZ9:AZ48, JAWABAN_PG!AZ8,\n            JAWABAN_PG!AZ50:AZ89, \">=\" & LARGE(JAWABAN_PG!AZ50:AZ89, $A$1)\n        )\n        -\n        COUNTIFS(\n            JAWABAN_PG!AZ9:AZ48, JAWABAN_PG!AZ8,\n            JAWABAN_PG!AZ50:AZ89, \"<=\" & SMALL(JAWABAN_PG!AZ50:AZ89, $A$1)\n        )\n    ) / $A$1\n)","v":""},{"$f":"IF(\n    COUNTA(JAWABAN_PG!BA9:BA48)=0,\n    \"\",\n    (\n        COUNTIFS(\n            JAWABAN_PG!BA9:BA48, JAWABAN_PG!BA8,\n            JAWABAN_PG!BA50:BA89, \">=\" & LARGE(JAWABAN_PG!BA50:BA89, $A$1)\n        )\n        -\n        COUNTIFS(\n            JAWABAN_PG!BA9:BA48, JAWABAN_PG!BA8,\n            JAWABAN_PG!BA50:BA89, \"<=\" & SMALL(JAWABAN_PG!BA50:BA89, $A$1)\n        )\n    ) / $A$1\n)","v":""}]
[null,null,"Jumlah Benar",{"$f":"IF(COUNT(D50:D89)=0,\"\",COUNTIF(D50:D89,1))","v":0},{"$f":"IF(COUNT(E50:E89)=0,\"\",COUNTIF(E50:E89,1))","v":12},{"$f":"IF(COUNT(F50:F89)=0,\"\",COUNTIF(F50:F89,1))","v":14},{"$f":"IF(COUNT(G50:G89)=0,\"\",COUNTIF(G50:G89,1))","v":5},{"$f":"IF(COUNT(H50:H89)=0,\"\",COUNTIF(H50:H89,1))","v":22},{"$f":"IF(COUNT(I50:I89)=0,\"\",COUNTIF(I50:I89,1))","v":22},{"$f":"IF(COUNT(J50:J89)=0,\"\",COUNTIF(J50:J89,1))","v":21},{"$f":"IF(COUNT(K50:K89)=0,\"\",COUNTIF(K50:K89,1))","v":11},{"$f":"IF(COUNT(L50:L89)=0,\"\",COUNTIF(L50:L89,1))","v":0},{"$f":"IF(COUNT(M50:M89)=0,\"\",COUNTIF(M50:M89,1))","v":12},{"$f":"IF(COUNT(N50:N89)=0,\"\",COUNTIF(N50:N89,1))","v":17},{"$f":"IF(COUNT(O50:O89)=0,\"\",COUNTIF(O50:O89,1))","v":0},{"$f":"IF(COUNT(P50:P89)=0,\"\",COUNTIF(P50:P89,1))","v":22},{"$f":"IF(COUNT(Q50:Q89)=0,\"\",COUNTIF(Q50:Q89,1))","v":21},{"$f":"IF(COUNT(R50:R89)=0,\"\",COUNTIF(R50:R89,1))","v":9},{"$f":"IF(COUNT(S50:S89)=0,\"\",COUNTIF(S50:S89,1))","v":7},{"$f":"IF(COUNT(T50:T89)=0,\"\",COUNTIF(T50:T89,1))","v":3},{"$f":"IF(COUNT(U50:U89)=0,\"\",COUNTIF(U50:U89,1))","v":20},{"$f":"IF(COUNT(V50:V89)=0,\"\",COUNTIF(V50:V89,1))","v":21},{"$f":"IF(COUNT(W50:W89)=0,\"\",COUNTIF(W50:W89,1))","v":22},{"$f":"IF(COUNT(X50:X89)=0,\"\",COUNTIF(X50:X89,1))","v":""},{"$f":"IF(COUNT(Y50:Y89)=0,\"\",COUNTIF(Y50:Y89,1))","v":""},{"$f":"IF(COUNT(Z50:Z89)=0,\"\",COUNTIF(Z50:Z89,1))","v":""},{"$f":"IF(COUNT(AA50:AA89)=0,\"\",COUNTIF(AA50:AA89,1))","v":""},{"$f":"IF(COUNT(AB50:AB89)=0,\"\",COUNTIF(AB50:AB89,1))","v":""},{"$f":"IF(COUNT(AC50:AC89)=0,\"\",COUNTIF(AC50:AC89,1))","v":""},{"$f":"IF(COUNT(AD50:AD89)=0,\"\",COUNTIF(AD50:AD89,1))","v":""},{"$f":"IF(COUNT(AE50:AE89)=0,\"\",COUNTIF(AE50:AE89,1))","v":""},{"$f":"IF(COUNT(AF50:AF89)=0,\"\",COUNTIF(AF50:AF89,1))","v":""},{"$f":"IF(COUNT(AG50:AG89)=0,\"\",COUNTIF(AG50:AG89,1))","v":""},{"$f":"IF(COUNT(AH50:AH89)=0,\"\",COUNTIF(AH50:AH89,1))","v":""},{"$f":"IF(COUNT(AI50:AI89)=0,\"\",COUNTIF(AI50:AI89,1))","v":""},{"$f":"IF(COUNT(AJ50:AJ89)=0,\"\",COUNTIF(AJ50:AJ89,1))","v":""},{"$f":"IF(COUNT(AK50:AK89)=0,\"\",COUNTIF(AK50:AK89,1))","v":""},{"$f":"IF(COUNT(AL50:AL89)=0,\"\",COUNTIF(AL50:AL89,1))","v":""},{"$f":"IF(COUNT(AM50:AM89)=0,\"\",COUNTIF(AM50:AM89,1))","v":""},{"$f":"IF(COUNT(AN50:AN89)=0,\"\",COUNTIF(AN50:AN89,1))","v":""},{"$f":"IF(COUNT(AO50:AO89)=0,\"\",COUNTIF(AO50:AO89,1))","v":""},{"$f":"IF(COUNT(AP50:AP89)=0,\"\",COUNTIF(AP50:AP89,1))","v":""},{"$f":"IF(COUNT(AQ50:AQ89)=0,\"\",COUNTIF(AQ50:AQ89,1))","v":""},{"$f":"IF(COUNT(AR50:AR89)=0,\"\",COUNTIF(AR50:AR89,1))","v":""},{"$f":"IF(COUNT(AS50:AS89)=0,\"\",COUNTIF(AS50:AS89,1))","v":""},{"$f":"IF(COUNT(AT50:AT89)=0,\"\",COUNTIF(AT50:AT89,1))","v":""},{"$f":"IF(COUNT(AU50:AU89)=0,\"\",COUNTIF(AU50:AU89,1))","v":""},{"$f":"IF(COUNT(AV50:AV89)=0,\"\",COUNTIF(AV50:AV89,1))","v":""},{"$f":"IF(COUNT(AW50:AW89)=0,\"\",COUNTIF(AW50:AW89,1))","v":""},{"$f":"IF(COUNT(AX50:AX89)=0,\"\",COUNTIF(AX50:AX89,1))","v":""},{"$f":"IF(COUNT(AY50:AY89)=0,\"\",COUNTIF(AY50:AY89,1))","v":""},{"$f":"IF(COUNT(AZ50:AZ89)=0,\"\",COUNTIF(AZ50:AZ89,1))","v":""},{"$f":"IF(COUNT(BA50:BA89)=0,\"\",COUNTIF(BA50:BA89,1))","v":""}]
[null,null,"Jumlah Salah",{"$f":"IF(COUNT(D50:D89)=0,\"\",COUNTIF(D50:D89,0))","v":23},{"$f":"IF(COUNT(E50:E89)=0,\"\",COUNTIF(E50:E89,0))","v":11},{"$f":"IF(COUNT(F50:F89)=0,\"\",COUNTIF(F50:F89,0))","v":9},{"$f":"IF(COUNT(G50:G89)=0,\"\",COUNTIF(G50:G89,0))","v":18},{"$f":"IF(COUNT(H50:H89)=0,\"\",COUNTIF(H50:H89,0))","v":1},{"$f":"IF(COUNT(I50:I89)=0,\"\",COUNTIF(I50:I89,0))","v":1},{"$f":"IF(COUNT(J50:J89)=0,\"\",COUNTIF(J50:J89,0))","v":2},{"$f":"IF(COUNT(K50:K89)=0,\"\",COUNTIF(K50:K89,0))","v":12},{"$f":"IF(COUNT(L50:L89)=0,\"\",COUNTIF(L50:L89,0))","v":23},{"$f":"IF(COUNT(M50:M89)=0,\"\",COUNTIF(M50:M89,0))","v":11},{"$f":"IF(COUNT(N50:N89)=0,\"\",COUNTIF(N50:N89,0))","v":6},{"$f":"IF(COUNT(O50:O89)=0,\"\",COUNTIF(O50:O89,0))","v":23},{"$f":"IF(COUNT(P50:P89)=0,\"\",COUNTIF(P50:P89,0))","v":1},{"$f":"IF(COUNT(Q50:Q89)=0,\"\",COUNTIF(Q50:Q89,0))","v":2},{"$f":"IF(COUNT(R50:R89)=0,\"\",COUNTIF(R50:R89,0))","v":14},{"$f":"IF(COUNT(S50:S89)=0,\"\",COUNTIF(S50:S89,0))","v":16},{"$f":"IF(COUNT(T50:T89)=0,\"\",COUNTIF(T50:T89,0))","v":20},{"$f":"IF(COUNT(U50:U89)=0,\"\",COUNTIF(U50:U89,0))","v":3},{"$f":"IF(COUNT(V50:V89)=0,\"\",COUNTIF(V50:V89,0))","v":2},{"$f":"IF(COUNT(W50:W89)=0,\"\",COUNTIF(W50:W89,0))","v":1},{"$f":"IF(COUNT(X50:X89)=0,\"\",COUNTIF(X50:X89,0))","v":""},{"$f":"IF(COUNT(Y50:Y89)=0,\"\",COUNTIF(Y50:Y89,0))","v":""},{"$f":"IF(COUNT(Z50:Z89)=0,\"\",COUNTIF(Z50:Z89,0))","v":""},{"$f":"IF(COUNT(AA50:AA89)=0,\"\",COUNTIF(AA50:AA89,0))","v":""},{"$f":"IF(COUNT(AB50:AB89)=0,\"\",COUNTIF(AB50:AB89,0))","v":""},{"$f":"IF(COUNT(AC50:AC89)=0,\"\",COUNTIF(AC50:AC89,0))","v":""},{"$f":"IF(COUNT(AD50:AD89)=0,\"\",COUNTIF(AD50:AD89,0))","v":""},{"$f":"IF(COUNT(AE50:AE89)=0,\"\",COUNTIF(AE50:AE89,0))","v":""},{"$f":"IF(COUNT(AF50:AF89)=0,\"\",COUNTIF(AF50:AF89,0))","v":""},{"$f":"IF(COUNT(AG50:AG89)=0,\"\",COUNTIF(AG50:AG89,0))","v":""},{"$f":"IF(COUNT(AH50:AH89)=0,\"\",COUNTIF(AH50:AH89,0))","v":""},{"$f":"IF(COUNT(AI50:AI89)=0,\"\",COUNTIF(AI50:AI89,0))","v":""},{"$f":"IF(COUNT(AJ50:AJ89)=0,\"\",COUNTIF(AJ50:AJ89,0))","v":""},{"$f":"IF(COUNT(AK50:AK89)=0,\"\",COUNTIF(AK50:AK89,0))","v":""},{"$f":"IF(COUNT(AL50:AL89)=0,\"\",COUNTIF(AL50:AL89,0))","v":""},{"$f":"IF(COUNT(AM50:AM89)=0,\"\",COUNTIF(AM50:AM89,0))","v":""},{"$f":"IF(COUNT(AN50:AN89)=0,\"\",COUNTIF(AN50:AN89,0))","v":""},{"$f":"IF(COUNT(AO50:AO89)=0,\"\",COUNTIF(AO50:AO89,0))","v":""},{"$f":"IF(COUNT(AP50:AP89)=0,\"\",COUNTIF(AP50:AP89,0))","v":""},{"$f":"IF(COUNT(AQ50:AQ89)=0,\"\",COUNTIF(AQ50:AQ89,0))","v":""},{"$f":"IF(COUNT(AR50:AR89)=0,\"\",COUNTIF(AR50:AR89,0))","v":""},{"$f":"IF(COUNT(AS50:AS89)=0,\"\",COUNTIF(AS50:AS89,0))","v":""},{"$f":"IF(COUNT(AT50:AT89)=0,\"\",COUNTIF(AT50:AT89,0))","v":""},{"$f":"IF(COUNT(AU50:AU89)=0,\"\",COUNTIF(AU50:AU89,0))","v":""},{"$f":"IF(COUNT(AV50:AV89)=0,\"\",COUNTIF(AV50:AV89,0))","v":""},{"$f":"IF(COUNT(AW50:AW89)=0,\"\",COUNTIF(AW50:AW89,0))","v":""},{"$f":"IF(COUNT(AX50:AX89)=0,\"\",COUNTIF(AX50:AX89,0))","v":""},{"$f":"IF(COUNT(AY50:AY89)=0,\"\",COUNTIF(AY50:AY89,0))","v":""},{"$f":"IF(COUNT(AZ50:AZ89)=0,\"\",COUNTIF(AZ50:AZ89,0))","v":""},{"$f":"IF(COUNT(BA50:BA89)=0,\"\",COUNTIF(BA50:BA89,0))","v":""}]
[null,null,"Rerata",{"$f":"IF(COUNT(D97:D136)=0,\"\",AVERAGE(IF(D97:D136<>\"\",D97:D136)))","v":0},{"$f":"IF(COUNT(E97:E136)=0,\"\",AVERAGE(IF(E97:E136<>\"\",E97:E136)))","v":2.6086956521739131},{"$f":"IF(COUNT(F97:F136)=0,\"\",AVERAGE(IF(F97:F136<>\"\",F97:F136)))","v":3.0434782608695654},{"$f":"IF(COUNT(G97:G136)=0,\"\",AVERAGE(IF(G97:G136<>\"\",G97:G136)))","v":1.0869565217391304},{"$f":"IF(COUNT(H97:H136)=0,\"\",AVERAGE(IF(H97:H136<>\"\",H97:H136)))","v":4.7826086956521738},{"$f":"IF(COUNT(I97:I136)=0,\"\",AVERAGE(IF(I97:I136<>\"\",I97:I136)))","v":4.7826086956521738},{"$f":"IF(COUNT(J97:J136)=0,\"\",AVERAGE(IF(J97:J136<>\"\",J97:J136)))","v":4.5652173913043477},{"$f":"IF(COUNT(K97:K136)=0,\"\",AVERAGE(IF(K97:K136<>\"\",K97:K136)))","v":2.3913043478260869},{"$f":"IF(COUNT(L97:L136)=0,\"\",AVERAGE(IF(L97:L136<>\"\",L97:L136)))","v":0},{"$f":"IF(COUNT(M97:M136)=0,\"\",AVERAGE(IF(M97:M136<>\"\",M97:M136)))","v":2.6086956521739131},{"$f":"IF(COUNT(N97:N136)=0,\"\",AVERAGE(IF(N97:N136<>\"\",N97:N136)))","v":3.6956521739130435},{"$f":"IF(COUNT(O97:O136)=0,\"\",AVERAGE(IF(O97:O136<>\"\",O97:O136)))","v":0},{"$f":"IF(COUNT(P97:P136)=0,\"\",AVERAGE(IF(P97:P136<>\"\",P97:P136)))","v":4.7826086956521738},{"$f":"IF(COUNT(Q97:Q136)=0,\"\",AVERAGE(IF(Q97:Q136<>\"\",Q97:Q136)))","v":4.5652173913043477},{"$f":"IF(COUNT(R97:R136)=0,\"\",AVERAGE(IF(R97:R136<>\"\",R97:R136)))","v":1.9565217391304348},{"$f":"IF(COUNT(S97:S136)=0,\"\",AVERAGE(IF(S97:S136<>\"\",S97:S136)))","v":1.5217391304347827},{"$f":"IF(COUNT(T97:T136)=0,\"\",AVERAGE(IF(T97:T136<>\"\",T97:T136)))","v":0.65217391304347827},{"$f":"IF(COUNT(U97:U136)=0,\"\",AVERAGE(IF(U97:U136<>\"\",U97:U136)))","v":4.3478260869565215},{"$f":"IF(COUNT(V97:V136)=0,\"\",AVERAGE(IF(V97:V136<>\"\",V97:V136)))","v":4.5652173913043477},{"$f":"IF(COUNT(W97:W136)=0,\"\",AVERAGE(IF(W97:W136<>\"\",W97:W136)))","v":4.7826086956521738},{"$f":"IF(COUNT(X97:X136)=0,\"\",AVERAGE(IF(X97:X136<>\"\",X97:X136)))","v":""},{"$f":"IF(COUNT(Y97:Y136)=0,\"\",AVERAGE(IF(Y97:Y136<>\"\",Y97:Y136)))","v":""},{"$f":"IF(COUNT(Z97:Z136)=0,\"\",AVERAGE(IF(Z97:Z136<>\"\",Z97:Z136)))","v":""},{"$f":"IF(COUNT(AA97:AA136)=0,\"\",AVERAGE(IF(AA97:AA136<>\"\",AA97:AA136)))","v":""},{"$f":"IF(COUNT(AB97:AB136)=0,\"\",AVERAGE(IF(AB97:AB136<>\"\",AB97:AB136)))","v":""},{"$f":"IF(COUNT(AC97:AC136)=0,\"\",AVERAGE(IF(AC97:AC136<>\"\",AC97:AC136)))","v":""},{"$f":"IF(COUNT(AD97:AD136)=0,\"\",AVERAGE(IF(AD97:AD136<>\"\",AD97:AD136)))","v":""},{"$f":"IF(COUNT(AE97:AE136)=0,\"\",AVERAGE(IF(AE97:AE136<>\"\",AE97:AE136)))","v":""},{"$f":"IF(COUNT(AF97:AF136)=0,\"\",AVERAGE(IF(AF97:AF136<>\"\",AF97:AF136)))","v":""},{"$f":"IF(COUNT(AG97:AG136)=0,\"\",AVERAGE(IF(AG97:AG136<>\"\",AG97:AG136)))","v":""},{"$f":"IF(COUNT(AH97:AH136)=0,\"\",AVERAGE(IF(AH97:AH136<>\"\",AH97:AH136)))","v":""},{"$f":"IF(COUNT(AI97:AI136)=0,\"\",AVERAGE(IF(AI97:AI136<>\"\",AI97:AI136)))","v":""},{"$f":"IF(COUNT(AJ97:AJ136)=0,\"\",AVERAGE(IF(AJ97:AJ136<>\"\",AJ97:AJ136)))","v":""},{"$f":"IF(COUNT(AK97:AK136)=0,\"\",AVERAGE(IF(AK97:AK136<>\"\",AK97:AK136)))","v":""},{"$f":"IF(COUNT(AL97:AL136)=0,\"\",AVERAGE(IF(AL97:AL136<>\"\",AL97:AL136)))","v":""},{"$f":"IF(COUNT(AM97:AM136)=0,\"\",AVERAGE(IF(AM97:AM136<>\"\",AM97:AM136)))","v":""},{"$f":"IF(COUNT(AN97:AN136)=0,\"\",AVERAGE(IF(AN97:AN136<>\"\",AN97:AN136)))","v":""},{"$f":"IF(COUNT(AO97:AO136)=0,\"\",AVERAGE(IF(AO97:AO136<>\"\",AO97:AO136)))","v":""},{"$f":"IF(COUNT(AP97:AP136)=0,\"\",AVERAGE(IF(AP97:AP136<>\"\",AP97:AP136)))","v":""},{"$f":"IF(COUNT(AQ97:AQ136)=0,\"\",AVERAGE(IF(AQ97:AQ136<>\"\",AQ97:AQ136)))","v":""},{"$f":"IF(COUNT(AR97:AR136)=0,\"\",AVERAGE(IF(AR97:AR136<>\"\",AR97:AR136)))","v":""},{"$f":"IF(COUNT(AS97:AS136)=0,\"\",AVERAGE(IF(AS97:AS136<>\"\",AS97:AS136)))","v":""},{"$f":"IF(COUNT(AT97:AT136)=0,\"\",AVERAGE(IF(AT97:AT136<>\"\",AT97:AT136)))","v":""},{"$f":"IF(COUNT(AU97:AU136)=0,\"\",AVERAGE(IF(AU97:AU136<>\"\",AU97:AU136)))","v":""},{"$f":"IF(COUNT(AV97:AV136)=0,\"\",AVERAGE(IF(AV97:AV136<>\"\",AV97:AV136)))","v":""},{"$f":"IF(COUNT(AW97:AW136)=0,\"\",AVERAGE(IF(AW97:AW136<>\"\",AW97:AW136)))","v":""},{"$f":"IF(COUNT(AX97:AX136)=0,\"\",AVERAGE(IF(AX97:AX136<>\"\",AX97:AX136)))","v":""},{"$f":"IF(COUNT(AY97:AY136)=0,\"\",AVERAGE(IF(AY97:AY136<>\"\",AY97:AY136)))","v":""},{"$f":"IF(COUNT(AZ97:AZ136)=0,\"\",AVERAGE(IF(AZ97:AZ136<>\"\",AZ97:AZ136)))","v":""},{"$f":"IF(COUNT(BA97:BA136)=0,\"\",AVERAGE(IF(BA97:BA136<>\"\",BA97:BA136)))","v":""}]
[1,null,null,{"$f":"IFERROR(D50*$D$6,\"\")","v":0},{"$f":"IFERROR(E50*$E$6,\"\")","v":5},{"$f":"IFERROR(F50*$F$6,\"\")","v":5},{"$f":"IFERROR(G50*$G$6,\"\")","v":0},{"$f":"IFERROR(H50*$H$6,\"\")","v":5},{"$f":"IFERROR(I50*$I$6,\"\")","v":5},{"$f":"IFERROR(J50*$J$6,\"\")","v":5},{"$f":"IFERROR(K50*$K$6,\"\")","v":5},{"$f":"IFERROR(L50*$L$6,\"\")","v":0},{"$f":"IFERROR(M50*$M$6,\"\")","v":5},{"$f":"IFERROR(N50*$N$6,\"\")","v":5},{"$f":"IFERROR(O50*$O$6,\"\")","v":0},{"$f":"IFERROR(P50*$P$6,\"\")","v":5},{"$f":"IFERROR(Q50*$Q$6,\"\")","v":5},{"$f":"IFERROR(R50*$R$6,\"\")","v":5},{"$f":"IFERROR(S50*$S$6,\"\")","v":0},{"$f":"IFERROR(T50*$T$6,\"\")","v":0},{"$f":"IFERROR(U50*$U$6,\"\")","v":5},{"$f":"IFERROR(V50*$V$6,\"\")","v":5},{"$f":"IFERROR(W50*$W$6,\"\")","v":5},{"$f":"IFERROR(X50*$X$6,\"\")","v":""},{"$f":"IFERROR(Y50*$Y$6,\"\")","v":""},{"$f":"IFERROR(Z50*$Z$6,\"\")","v":""},{"$f":"IFERROR(AA50*$AA$6,\"\")","v":""},{"$f":"IFERROR(AB50*$AB$6,\"\")","v":""},{"$f":"IFERROR(AC50*$AC$6,\"\")","v":""},{"$f":"IFERROR(AD50*$AD$6,\"\")","v":""},{"$f":"IFERROR(AE50*$AE$6,\"\")","v":""},{"$f":"IFERROR(AF50*$AF$6,\"\")","v":""},{"$f":"IFERROR(AG50*$AG$6,\"\")","v":""},{"$f":"IFERROR(AH50*$AH$6,\"\")","v":""},{"$f":"IFERROR(AI50*$AI$6,\"\")","v":""},{"$f":"IFERROR(AJ50*$AJ$6,\"\")","v":""},{"$f":"IFERROR(AK50*$AK$6,\"\")","v":""},{"$f":"IFERROR(AL50*$AL$6,\"\")","v":""},{"$f":"IFERROR(AM50*$AM$6,\"\")","v":""},{"$f":"IFERROR(AN50*$AN$6,\"\")","v":""},{"$f":"IFERROR(AO50*$AO$6,\"\")","v":""},{"$f":"IFERROR(AP50*$AP$6,\"\")","v":""},{"$f":"IFERROR(AQ50*$AQ$6,\"\")","v":""},{"$f":"IFERROR(AR50*$AR$6,\"\")","v":""},{"$f":"IFERROR(AS50*$AS$6,\"\")","v":""},{"$f":"IFERROR(AT50*$AT$6,\"\")","v":""},{"$f":"IFERROR(AU50*$AU$6,\"\")","v":""},{"$f":"IFERROR(AV50*$AV$6,\"\")","v":""},{"$f":"IFERROR(AW50*$AW$6,\"\")","v":""},{"$f":"IFERROR(AX50*$AX$6,\"\")","v":""},{"$f":"IFERROR(AY50*$AY$6,\"\")","v":""},{"$f":"IFERROR(AZ50*$AZ$6,\"\")","v":""},{"$f":"IFERROR(BA50*$BA$6,\"\")","v":""}]
[2,null,null,{"$f":"IFERROR(D51*$D$6,\"\")","v":0},{"$f":"IFERROR(E51*$E$6,\"\")","v":0},{"$f":"IFERROR(F51*$F$6,\"\")","v":5},{"$f":"IFERROR(G51*$G$6,\"\")","v":5},{"$f":"IFERROR(H51*$H$6,\"\")","v":5},{"$f":"IFERROR(I51*$I$6,\"\")","v":5},{"$f":"IFERROR(J51*$J$6,\"\")","v":5},{"$f":"IFERROR(K51*$K$6,\"\")","v":5},{"$f":"IFERROR(L51*$L$6,\"\")","v":0},{"$f":"IFERROR(M51*$M$6,\"\")","v":0},{"$f":"IFERROR(N51*$N$6,\"\")","v":0},{"$f":"IFERROR(O51*$O$6,\"\")","v":0},{"$f":"IFERROR(P51*$P$6,\"\")","v":5},{"$f":"IFERROR(Q51*$Q$6,\"\")","v":5},{"$f":"IFERROR(R51*$R$6,\"\")","v":5},{"$f":"IFERROR(S51*$S$6,\"\")","v":0},{"$f":"IFERROR(T51*$T$6,\"\")","v":0},{"$f":"IFERROR(U51*$U$6,\"\")","v":5},{"$f":"IFERROR(V51*$V$6,\"\")","v":5},{"$f":"IFERROR(W51*$W$6,\"\")","v":5},{"$f":"IFERROR(X51*$X$6,\"\")","v":""},{"$f":"IFERROR(Y51*$Y$6,\"\")","v":""},{"$f":"IFERROR(Z51*$Z$6,\"\")","v":""},{"$f":"IFERROR(AA51*$AA$6,\"\")","v":""},{"$f":"IFERROR(AB51*$AB$6,\"\")","v":""},{"$f":"IFERROR(AC51*$AC$6,\"\")","v":""},{"$f":"IFERROR(AD51*$AD$6,\"\")","v":""},{"$f":"IFERROR(AE51*$AE$6,\"\")","v":""},{"$f":"IFERROR(AF51*$AF$6,\"\")","v":""},{"$f":"IFERROR(AG51*$AG$6,\"\")","v":""},{"$f":"IFERROR(AH51*$AH$6,\"\")","v":""},{"$f":"IFERROR(AI51*$AI$6,\"\")","v":""},{"$f":"IFERROR(AJ51*$AJ$6,\"\")","v":""},{"$f":"IFERROR(AK51*$AK$6,\"\")","v":""},{"$f":"IFERROR(AL51*$AL$6,\"\")","v":""},{"$f":"IFERROR(AM51*$AM$6,\"\")","v":""},{"$f":"IFERROR(AN51*$AN$6,\"\")","v":""},{"$f":"IFERROR(AO51*$AO$6,\"\")","v":""},{"$f":"IFERROR(AP51*$AP$6,\"\")","v":""},{"$f":"IFERROR(AQ51*$AQ$6,\"\")","v":""},{"$f":"IFERROR(AR51*$AR$6,\"\")","v":""},{"$f":"IFERROR(AS51*$AS$6,\"\")","v":""},{"$f":"IFERROR(AT51*$AT$6,\"\")","v":""},{"$f":"IFERROR(AU51*$AU$6,\"\")","v":""},{"$f":"IFERROR(AV51*$AV$6,\"\")","v":""},{"$f":"IFERROR(AW51*$AW$6,\"\")","v":""},{"$f":"IFERROR(AX51*$AX$6,\"\")","v":""},{"$f":"IFERROR(AY51*$AY$6,\"\")","v":""},{"$f":"IFERROR(AZ51*$AZ$6,\"\")","v":""},{"$f":"IFERROR(BA51*$BA$6,\"\")","v":""}]
[3,null,null,0,5,5,5,5,5,5,0,0,0,5,0,5,5,5,5,0,5,5,5,"","","","","","","","","","","","","","","","","","","","","","","","","","","","","",""]
[4,null,null,0,0,5,5,5,5,5,5,0,0,0,0,5,5,5,0,0,5,5,5,"","","","","","","","","","","","","","","","","","","","","","","","","","","","","",""]
[5,null,null,"","","","","","","","","","","","","","","","","","","","","","","","","","","","","","","","","","","","","","","","","","","","","","","","","",""]
[6,null,null,0,0,0,0,5,5,5,5,0,5,5,0,5,5,5,5,5,5,5,5,"","","","","","","","","","","","","","","","","","","","","","","","","","","","","",""]
[7,null,null,0,0,0,5,5,5,5,0,0,0,0,0,5,5,0,0,0,5,5,5,"","","","","","","","","","","","","","","","","","","","","","","","","","","","","",""]
[8,null,null,0,5,0,0,5,5,5,5,0,5,0,0,5,5,5,0,0,5,5,5,"","","","","","","","","","","","","","","","","","","","","","","","","","","","","",""]
[9,null,null,0,5,5,0,5,5,5,0,0,0,5,0,5,5,5,5,0,5,5,5,"","","","","","","","","","","","","","","","","","","","","","","","","","","","","",""]
[10,null,null,0,5,5,5,5,5,5,5,0,5,5,0,5,5,0,5,0,5,5,5,"","","","","","","","","","","","","","","","","","","","","","","","","","","","","",""]
[11,null,null,0,0,0,0,5,5,5,5,0,5,0,0,5,0,0,0,0,0,0,5,"","","","","","","","","","","","","","","","","","","","","","","","","","","","","",""]
[12,null,null,0,5,5,0,5,5,0,5,0,5,5,0,5,5,0,0,0,5,5,5,"","","","","","","","","","","","","","","","","","","","","","","","","","","","","",""]
[13,null,null,0,0,0,0,5,5,5,5,0,0,5,0,5,5,0,0,0,5,5,5,"","","","","","","","","","","","","","","","","","","","","","","","","","","","","",""]
[14,null,null,0,5,5,0,5,5,5,5,0,5,5,0,5,5,0,0,0,0,5,5,"","","","","","","","","","","","","","","","","","","","","","","","","","","","","",""]
[15,null,null,0,5,5,0,5,5,5,0,0,0,5,0,5,5,0,0,0,5,5,5,"","","","","","","","","","","","","","","","","","","","","","","","","","","","","",""]
[16,null,null,0,5,5,0,5,5,5,0,0,0,5,0,5,5,0,0,0,5,5,5,"","","","","","","","","","","","","","","","","","","","","","","","","","","","","",""]
[17,null,null,0,5,5,0,5,5,5,0,0,5,5,0,5,5,5,5,0,5,5,5,"","","","","","","","","","","","","","","","","","","","","","","","","","","","","",""]
[18,null,null,0,0,0,0,5,5,5,0,0,5,5,0,5,5,0,0,0,5,5,5,"","","","","","","","","","","","","","","","","","","","","","","","","","","","","",""]
[19,null,null,0,0,0,0,5,5,5,0,0,5,5,0,5,5,0,0,0,5,5,5,"","","","","","","","","","","","","","","","","","","","","","","","","","","","","",""]
[20,null,null,0,0,0,0,5,5,5,0,0,0,5,0,5,5,0,0,0,5,5,5,"","","","","","","","","","","","","","","","","","","","","","","","","","","","","",""]
[21,null,null,0,5,5,0,5,5,5,5,0,5,5,0,5,5,5,5,5,5,5,5,"","","","","","","","","","","","","","","","","","","","","","","","","","","","","",""]
[22,null,null,0,5,5,0,5,5,5,0,0,5,5,0,5,5,0,0,0,5,5,5,"","","","","","","","","","","","","","","","","","","","","","","","","","","","","",""]
[23,null,null,0,0,0,0,5,5,5,0,0,0,5,0,5,5,0,5,5,5,5,5,"","","","","","","","","","","","","","","","","","","","","","","","","","","","","",""]
[24,null,null,0,0,5,0,0,0,0,0,0,0,0,0,0,0,0,0,0,0,0,0,"","","","","","","","","","","","","","","","","","","","","","","","","","","","","",""]
[25,null,null,"","","","","","","","","","","","","","","","","","","","","","","","","","","","","","","","","","","","","","","","","","","","","","","","","",""]
[26,null,null,"","","","","","","","","","","","","","","","","","","","","","","","","","","","","","","","","","","","","","","","","","","","","","","","","",""]
[27,null,null,"","","","","","","","","","","","","","","","","","","","","","","","","","","","","","","","","","","","","","","","","","","","","","","","","",""]
[28,null,null,"","","","","","","","","","","","","","","","","","","","","","","","","","","","","","","","","","","","","","","","","","","","","","","","","",""]
[29,null,null,"","","","","","","","","","","","","","","","","","","","","","","","","","","","","","","","","","","","","","","","","","","","","","","","","",""]
[30,null,null,"","","","","","","","","","","","","","","","","","","","","","","","","","","","","","","","","","","","","","","","","","","","","","","","","",""]
[31,null,null,"","","","","","","","","","","","","","","","","","","","","","","","","","","","","","","","","","","","","","","","","","","","","","","","","",""]
[32,null,null,"","","","","","","","","","","","","","","","","","","","","","","","","","","","","","","","","","","","","","","","","","","","","","","","","",""]
[33,null,null,"","","","","","","","","","","","","","","","","","","","","","","","","","","","","","","","","","","","","","","","","","","","","","","","","",""]
[34,null,null,"","","","","","","","","","","","","","","","","","","","","","","","","","","","","","","","","","","","","","","","","","","","","","","","","",""]
[35,null,null,"","","","","","","","","","","","","","","","","","","","","","","","","","","","","","","","","","","","","","","","","","","","","","","","","",""]
[36,null,null,"","","","","","","","","","","","","","","","","","","","","","","","","","","","","","","","","","","","","","","","","","","","","","","","","",""]
[37,null,null,"","","","","","","","","","","","","","","","","","","","","","","","","","","","","","","","","","","","","","","","","","","","","","","","","",""]
[38,null,null,"","","","","","","","","","","","","","","","","","","","","","","","","","","","","","","","","","","","","","","","","","","","","","","","","",""]
[39,null,null,"","","","","","","","","","","","","","","","","","","","","","","","","","","","","","","","","","","","","","","","","","","","","","","","","",""]
[40,null,null,"","","","","","","","","","","","","","","","","","","","","","","","","","","","","","","","","","","","","","","","","","","","","","","","","",""]

{"sheet":"STATISTIK_PG","index":2,"n_rows":65,"n_cols":55,"rows_kept":65,"cut":false,"hidden":false,"merged":[[5,54,6,54],[5,3,5,52],[5,0,6,0],[5,1,6,1],[5,2,6,2],[5,53,6,53]]}
[]
[]
[]
[]
["A. DISTRIBUSI JAWABAN PILIHAN GANDA"]
["NO","NISN","NAMA","SKOR JAWABAN PER SOAL",null,null,null,null,null,null,null,null,null,null,null,null,null,null,null,null,null,null,null,null,null,null,null,null,null,null,null,null,null,null,null,null,null,null,null,null,null,null,null,null,null,null,null,null,null,null,null,null,null,"NILAI","T/BT"]
[null,null,null,1,2,3,4,5,6,7,8,9,10,11,12,13,14,15,16,17,18,19,20,21,22,23,24,25,26,27,28,29,30,31,32,33,34,35,36,37,38,39,40,41,42,43,44,45,46,47,48,49,50]
[1,{"$f":"IF(VALUE(DATA!B6)=0, \"\", TEXT(VALUE(DATA!B6), REPT(\"0\", LEN(DATA!B6))))","v":"0104009164"},{"$f":"IF(DATA!C6=\"\",\"\",DATA!C6)","v":"AGUS FIRMAN SYABANI"},{"$f":"JAWABAN_PG!D97","v":0},{"$f":"JAWABAN_PG!E97","v":5},{"$f":"JAWABAN_PG!F97","v":5},{"$f":"JAWABAN_PG!G97","v":0},{"$f":"JAWABAN_PG!H97","v":5},{"$f":"JAWABAN_PG!I97","v":5},{"$f":"JAWABAN_PG!J97","v":5},{"$f":"JAWABAN_PG!K97","v":5},{"$f":"JAWABAN_PG!L97","v":0},{"$f":"JAWABAN_PG!M97","v":5},{"$f":"JAWABAN_PG!N97","v":5},{"$f":"JAWABAN_PG!O97","v":0},{"$f":"JAWABAN_PG!P97","v":5},{"$f":"JAWABAN_PG!Q97","v":5},{"$f":"JAWABAN_PG!R97","v":5},{"$f":"JAWABAN_PG!S97","v":0},{"$f":"JAWABAN_PG!T97","v":0},{"$f":"JAWABAN_PG!U97","v":5},{"$f":"JAWABAN_PG!V97","v":5},{"$f":"JAWABAN_PG!W97","v":5},{"$f":"JAWABAN_PG!X97","v":""},{"$f":"JAWABAN_PG!Y97","v":""},{"$f":"JAWABAN_PG!Z97","v":""},{"$f":"JAWABAN_PG!AA97","v":""},{"$f":"JAWABAN_PG!AB97","v":""},{"$f":"JAWABAN_PG!AC97","v":""},{"$f":"JAWABAN_PG!AD97","v":""},{"$f":"JAWABAN_PG!AE97","v":""},{"$f":"JAWABAN_PG!AF97","v":""},{"$f":"JAWABAN_PG!AG97","v":""},{"$f":"JAWABAN_PG!AH97","v":""},{"$f":"JAWABAN_PG!AI97","v":""},{"$f":"JAWABAN_PG!AJ97","v":""},{"$f":"JAWABAN_PG!AK97","v":""},{"$f":"JAWABAN_PG!AL97","v":""},{"$f":"JAWABAN_PG!AM97","v":""},{"$f":"JAWABAN_PG!AN97","v":""},{"$f":"JAWABAN_PG!AO97","v":""},{"$f":"JAWABAN_PG!AP97","v":""},{"$f":"JAWABAN_PG!AQ97","v":""},{"$f":"JAWABAN_PG!AR97","v":""},{"$f":"JAWABAN_PG!AS97","v":""},{"$f":"JAWABAN_PG!AT97","v":""},{"$f":"JAWABAN_PG!AU97","v":""},{"$f":"JAWABAN_PG!AV97","v":""},{"$f":"JAWABAN_PG!AW97","v":""},{"$f":"JAWABAN_PG!AX97","v":""},{"$f":"JAWABAN_PG!AY97","v":""},{"$f":"JAWABAN_PG!AZ97","v":""},{"$f":"JAWABAN_PG!BA97","v":""},{"$f":"SUM(D8:BA8)","v":70},{"$f":"IF(BB8>=DATA!$G$15,\"TUNTAS\",\"BELUM TUNTAS\")","v":"BELUM TUNTAS"}]
[2,{"$f":"IF(VALUE(DATA!B7)=0, \"\", TEXT(VALUE(DATA!B7), REPT(\"0\", LEN(DATA!B7))))","v":"0096257187"},{"$f":"IF(DATA!C7=\"\",\"\",DATA!C7)","v":"Aisyah"},{"$f":"JAWABAN_PG!D98","v":0},{"$f":"JAWABAN_PG!E98","v":0},{"$f":"JAWABAN_PG!F98","v":5},{"$f":"JAWABAN_PG!G98","v":5},{"$f":"JAWABAN_PG!H98","v":5},{"$f":"JAWABAN_PG!I98","v":5},{"$f":"JAWABAN_PG!J98","v":5},{"$f":"JAWABAN_PG!K98","v":5},{"$f":"JAWABAN_PG!L98","v":0},{"$f":"JAWABAN_PG!M98","v":0},{"$f":"JAWABAN_PG!N98","v":0},{"$f":"JAWABAN_PG!O98","v":0},{"$f":"JAWABAN_PG!P98","v":5},{"$f":"JAWABAN_PG!Q98","v":5},{"$f":"JAWABAN_PG!R98","v":5},{"$f":"JAWABAN_PG!S98","v":0},{"$f":"JAWABAN_PG!T98","v":0},{"$f":"JAWABAN_PG!U98","v":5},{"$f":"JAWABAN_PG!V98","v":5},{"$f":"JAWABAN_PG!W98","v":5},{"$f":"JAWABAN_PG!X98","v":""},{"$f":"JAWABAN_PG!Y98","v":""},{"$f":"JAWABAN_PG!Z98","v":""},{"$f":"JAWABAN_PG!AA98","v":""},{"$f":"JAWABAN_PG!AB98","v":""},{"$f":"JAWABAN_PG!AC98","v":""},{"$f":"JAWABAN_PG!AD98","v":""},{"$f":"JAWABAN_PG!AE98","v":""},{"$f":"JAWABAN_PG!AF98","v":""},{"$f":"JAWABAN_PG!AG98","v":""},{"$f":"JAWABAN_PG!AH98","v":""},{"$f":"JAWABAN_PG!AI98","v":""},{"$f":"JAWABAN_PG!AJ98","v":""},{"$f":"JAWABAN_PG!AK98","v":""},{"$f":"JAWABAN_PG!AL98","v":""},{"$f":"JAWABAN_PG!AM98","v":""},{"$f":"JAWABAN_PG!AN98","v":""},{"$f":"JAWABAN_PG!AO98","v":""},{"$f":"JAWABAN_PG!AP98","v":""},{"$f":"JAWABAN_PG!AQ98","v":""},{"$f":"JAWABAN_PG!AR98","v":""},{"$f":"JAWABAN_PG!AS98","v":""},{"$f":"JAWABAN_PG!AT98","v":""},{"$f":"JAWABAN_PG!AU98","v":""},{"$f":"JAWABAN_PG!AV98","v":""},{"$f":"JAWABAN_PG!AW98","v":""},{"$f":"JAWABAN_PG!AX98","v":""},{"$f":"JAWABAN_PG!AY98","v":""},{"$f":"JAWABAN_PG!AZ98","v":""},{"$f":"JAWABAN_PG!BA98","v":""},{"$f":"SUM(D9:BA9)","v":60},{"$f":"IF(BB9>=DATA!$G$15,\"TUNTAS\",\"BELUM TUNTAS\")","v":"BELUM TUNTAS"}]
[3,{"$f":"IF(VALUE(DATA!B8)=0, \"\", TEXT(VALUE(DATA!B8), REPT(\"0\", LEN(DATA!B8))))","v":"0099072726"},{"$f":"IF(DATA!C8=\"\",\"\",DATA!C8)","v":"AMELIA CARISA PUTRI"},{"$f":"JAWABAN_PG!D99","v":0},{"$f":"JAWABAN_PG!E99","v":5},{"$f":"JAWABAN_PG!F99","v":5},{"$f":"JAWABAN_PG!G99","v":5},{"$f":"JAWABAN_PG!H99","v":5},{"$f":"JAWABAN_PG!I99","v":5},{"$f":"JAWABAN_PG!J99","v":5},{"$f":"JAWABAN_PG!K99","v":0},{"$f":"JAWABAN_PG!L99","v":0},{"$f":"JAWABAN_PG!M99","v":0},{"$f":"JAWABAN_PG!N99","v":5},{"$f":"JAWABAN_PG!O99","v":0},{"$f":"JAWABAN_PG!P99","v":5},{"$f":"JAWABAN_PG!Q99","v":5},{"$f":"JAWABAN_PG!R99","v":5},{"$f":"JAWABAN_PG!S99","v":5},{"$f":"JAWABAN_PG!T99","v":0},{"$f":"JAWABAN_PG!U99","v":5},{"$f":"JAWABAN_PG!V99","v":5},{"$f":"JAWABAN_PG!W99","v":5},{"$f":"JAWABAN_PG!X99","v":""},{"$f":"JAWABAN_PG!Y99","v":""},{"$f":"JAWABAN_PG!Z99","v":""},{"$f":"JAWABAN_PG!AA99","v":""},{"$f":"JAWABAN_PG!AB99","v":""},{"$f":"JAWABAN_PG!AC99","v":""},{"$f":"JAWABAN_PG!AD99","v":""},{"$f":"JAWABAN_PG!AE99","v":""},{"$f":"JAWABAN_PG!AF99","v":""},{"$f":"JAWABAN_PG!AG99","v":""},{"$f":"JAWABAN_PG!AH99","v":""},{"$f":"JAWABAN_PG!AI99","v":""},{"$f":"JAWABAN_PG!AJ99","v":""},{"$f":"JAWABAN_PG!AK99","v":""},{"$f":"JAWABAN_PG!AL99","v":""},{"$f":"JAWABAN_PG!AM99","v":""},{"$f":"JAWABAN_PG!AN99","v":""},{"$f":"JAWABAN_PG!AO99","v":""},{"$f":"JAWABAN_PG!AP99","v":""},{"$f":"JAWABAN_PG!AQ99","v":""},{"$f":"JAWABAN_PG!AR99","v":""},{"$f":"JAWABAN_PG!AS99","v":""},{"$f":"JAWABAN_PG!AT99","v":""},{"$f":"JAWABAN_PG!AU99","v":""},{"$f":"JAWABAN_PG!AV99","v":""},{"$f":"JAWABAN_PG!AW99","v":""},{"$f":"JAWABAN_PG!AX99","v":""},{"$f":"JAWABAN_PG!AY99","v":""},{"$f":"JAWABAN_PG!AZ99","v":""},{"$f":"JAWABAN_PG!BA99","v":""},70,{"$f":"IF(BB10>=DATA!$G$15,\"TUNTAS\",\"BELUM TUNTAS\")","v":"BELUM TUNTAS"}]
[4,{"$f":"IF(VALUE(DATA!B9)=0, \"\", TEXT(VALUE(DATA!B9), REPT(\"0\", LEN(DATA!B9))))","v":"3097509262"},{"$f":"IF(DATA!C9=\"\",\"\",DATA!C9)","v":"APINA INTAN AULIA"},{"$f":"JAWABAN_PG!D100","v":0},{"$f":"JAWABAN_PG!E100","v":0},{"$f":"JAWABAN_PG!F100","v":5},{"$f":"JAWABAN_PG!G100","v":5},{"$f":"JAWABAN_PG!H100","v":5},{"$f":"JAWABAN_PG!I100","v":5},{"$f":"JAWABAN_PG!J100","v":5},{"$f":"JAWABAN_PG!K100","v":5},{"$f":"JAWABAN_PG!L100","v":0},{"$f":"JAWABAN_PG!M100","v":0},{"$f":"JAWABAN_PG!N100","v":0},{"$f":"JAWABAN_PG!O100","v":0},{"$f":"JAWABAN_PG!P100","v":5},{"$f":"JAWABAN_PG!Q100","v":5},{"$f":"JAWABAN_PG!R100","v":5},{"$f":"JAWABAN_PG!S100","v":0},{"$f":"JAWABAN_PG!T100","v":0},{"$f":"JAWABAN_PG!U100","v":5},{"$f":"JAWABAN_PG!V100","v":5},{"$f":"JAWABAN_PG!W100","v":5},{"$f":"JAWABAN_PG!X100","v":""},{"$f":"JAWABAN_PG!Y100","v":""},{"$f":"JAWABAN_PG!Z100","v":""},{"$f":"JAWABAN_PG!AA100","v":""},{"$f":"JAWABAN_PG!AB100","v":""},{"$f":"JAWABAN_PG!AC100","v":""},{"$f":"JAWABAN_PG!AD100","v":""},{"$f":"JAWABAN_PG!AE100","v":""},{"$f":"JAWABAN_PG!AF100","v":""},{"$f":"JAWABAN_PG!AG100","v":""},{"$f":"JAWABAN_PG!AH100","v":""},{"$f":"JAWABAN_PG!AI100","v":""},{"$f":"JAWABAN_PG!AJ100","v":""},{"$f":"JAWABAN_PG!AK100","v":""},{"$f":"JAWABAN_PG!AL100","v":""},{"$f":"JAWABAN_PG!AM100","v":""},{"$f":"JAWABAN_PG!AN100","v":""},{"$f":"JAWABAN_PG!AO100","v":""},{"$f":"JAWABAN_PG!AP100","v":""},{"$f":"JAWABAN_PG!AQ100","v":""},{"$f":"JAWABAN_PG!AR100","v":""},{"$f":"JAWABAN_PG!AS100","v":""},{"$f":"JAWABAN_PG!AT100","v":""},{"$f":"JAWABAN_PG!AU100","v":""},{"$f":"JAWABAN_PG!AV100","v":""},{"$f":"JAWABAN_PG!AW100","v":""},{"$f":"JAWABAN_PG!AX100","v":""},{"$f":"JAWABAN_PG!AY100","v":""},{"$f":"JAWABAN_PG!AZ100","v":""},{"$f":"JAWABAN_PG!BA100","v":""},60,{"$f":"IF(BB11>=DATA!$G$15,\"TUNTAS\",\"BELUM TUNTAS\")","v":"BELUM TUNTAS"}]
[5,{"$f":"IF(VALUE(DATA!B10)=0, \"\", TEXT(VALUE(DATA!B10), REPT(\"0\", LEN(DATA!B10))))","v":"0096438158"},{"$f":"IF(DATA!C10=\"\",\"\",DATA!C10)","v":"ARIA TIRTA ANGGARA"},{"$f":"JAWABAN_PG!D101","v":""},{"$f":"JAWABAN_PG!E101","v":""},{"$f":"JAWABAN_PG!F101","v":""},{"$f":"JAWABAN_PG!G101","v":""},{"$f":"JAWABAN_PG!H101","v":""},{"$f":"JAWABAN_PG!I101","v":""},{"$f":"JAWABAN_PG!J101","v":""},{"$f":"JAWABAN_PG!K101","v":""},{"$f":"JAWABAN_PG!L101","v":""},{"$f":"JAWABAN_PG!M101","v":""},{"$f":"JAWABAN_PG!N101","v":""},{"$f":"JAWABAN_PG!O101","v":""},{"$f":"JAWABAN_PG!P101","v":""},{"$f":"JAWABAN_PG!Q101","v":""},{"$f":"JAWABAN_PG!R101","v":""},{"$f":"JAWABAN_PG!S101","v":""},{"$f":"JAWABAN_PG!T101","v":""},{"$f":"JAWABAN_PG!U101","v":""},{"$f":"JAWABAN_PG!V101","v":""},{"$f":"JAWABAN_PG!W101","v":""},{"$f":"JAWABAN_PG!X101","v":""},{"$f":"JAWABAN_PG!Y101","v":""},{"$f":"JAWABAN_PG!Z101","v":""},{"$f":"JAWABAN_PG!AA101","v":""},{"$f":"JAWABAN_PG!AB101","v":""},{"$f":"JAWABAN_PG!AC101","v":""},{"$f":"JAWABAN_PG!AD101","v":""},{"$f":"JAWABAN_PG!AE101","v":""},{"$f":"JAWABAN_PG!AF101","v":""},{"$f":"JAWABAN_PG!AG101","v":""},{"$f":"JAWABAN_PG!AH101","v":""},{"$f":"JAWABAN_PG!AI101","v":""},{"$f":"JAWABAN_PG!AJ101","v":""},{"$f":"JAWABAN_PG!AK101","v":""},{"$f":"JAWABAN_PG!AL101","v":""},{"$f":"JAWABAN_PG!AM101","v":""},{"$f":"JAWABAN_PG!AN101","v":""},{"$f":"JAWABAN_PG!AO101","v":""},{"$f":"JAWABAN_PG!AP101","v":""},{"$f":"JAWABAN_PG!AQ101","v":""},{"$f":"JAWABAN_PG!AR101","v":""},{"$f":"JAWABAN_PG!AS101","v":""},{"$f":"JAWABAN_PG!AT101","v":""},{"$f":"JAWABAN_PG!AU101","v":""},{"$f":"JAWABAN_PG!AV101","v":""},{"$f":"JAWABAN_PG!AW101","v":""},{"$f":"JAWABAN_PG!AX101","v":""},{"$f":"JAWABAN_PG!AY101","v":""},{"$f":"JAWABAN_PG!AZ101","v":""},{"$f":"JAWABAN_PG!BA101","v":""},0,{"$f":"IF(BB12>=DATA!$G$15,\"TUNTAS\",\"BELUM TUNTAS\")","v":"BELUM TUNTAS"}]
[6,{"$f":"IF(VALUE(DATA!B11)=0, \"\", TEXT(VALUE(DATA!B11), REPT(\"0\", LEN(DATA!B11))))","v":"0081324455"},{"$f":"IF(DATA!C11=\"\",\"\",DATA!C11)","v":"BAGAS DWI PUTRA"},{"$f":"JAWABAN_PG!D102","v":0},{"$f":"JAWABAN_PG!E102","v":0},{"$f":"JAWABAN_PG!F102","v":0},{"$f":"JAWABAN_PG!G102","v":0},{"$f":"JAWABAN_PG!H102","v":5},{"$f":"JAWABAN_PG!I102","v":5},{"$f":"JAWABAN_PG!J102","v":5},{"$f":"JAWABAN_PG!K102","v":5},{"$f":"JAWABAN_PG!L102","v":0},{"$f":"JAWABAN_PG!M102","v":5},{"$f":"JAWABAN_PG!N102","v":5},{"$f":"JAWABAN_PG!O102","v":0},{"$f":"JAWABAN_PG!P102","v":5},{"$f":"JAWABAN_PG!Q102","v":5},{"$f":"JAWABAN_PG!R102","v":5},{"$f":"JAWABAN_PG!S102","v":5},{"$f":"JAWABAN_PG!T102","v":5},{"$f":"JAWABAN_PG!U102","v":5},{"$f":"JAWABAN_PG!V102","v":5},{"$f":"JAWABAN_PG!W102","v":5},{"$f":"JAWABAN_PG!X102","v":""},{"$f":"JAWABAN_PG!Y102","v":""},{"$f":"JAWABAN_PG!Z102","v":""},{"$f":"JAWABAN_PG!AA102","v":""},{"$f":"JAWABAN_PG!AB102","v":""},{"$f":"JAWABAN_PG!AC102","v":""},{"$f":"JAWABAN_PG!AD102","v":""},{"$f":"JAWABAN_PG!AE102","v":""},{"$f":"JAWABAN_PG!AF102","v":""},{"$f":"JAWABAN_PG!AG102","v":""},{"$f":"JAWABAN_PG!AH102","v":""},{"$f":"JAWABAN_PG!AI102","v":""},{"$f":"JAWABAN_PG!AJ102","v":""},{"$f":"JAWABAN_PG!AK102","v":""},{"$f":"JAWABAN_PG!AL102","v":""},{"$f":"JAWABAN_PG!AM102","v":""},{"$f":"JAWABAN_PG!AN102","v":""},{"$f":"JAWABAN_PG!AO102","v":""},{"$f":"JAWABAN_PG!AP102","v":""},{"$f":"JAWABAN_PG!AQ102","v":""},{"$f":"JAWABAN_PG!AR102","v":""},{"$f":"JAWABAN_PG!AS102","v":""},{"$f":"JAWABAN_PG!AT102","v":""},{"$f":"JAWABAN_PG!AU102","v":""},{"$f":"JAWABAN_PG!AV102","v":""},{"$f":"JAWABAN_PG!AW102","v":""},{"$f":"JAWABAN_PG!AX102","v":""},{"$f":"JAWABAN_PG!AY102","v":""},{"$f":"JAWABAN_PG!AZ102","v":""},{"$f":"JAWABAN_PG!BA102","v":""},70,{"$f":"IF(BB13>=DATA!$G$15,\"TUNTAS\",\"BELUM TUNTAS\")","v":"BELUM TUNTAS"}]
[7,{"$f":"IF(VALUE(DATA!B12)=0, \"\", TEXT(VALUE(DATA!B12), REPT(\"0\", LEN(DATA!B12))))","v":"0105997732"},{"$f":"IF(DATA!C12=\"\",\"\",DATA!C12)","v":"DEA LESTARI"},{"$f":"JAWABAN_PG!D103","v":0},{"$f":"JAWABAN_PG!E103","v":0},{"$f":"JAWABAN_PG!F103","v":0},{"$f":"JAWABAN_PG!G103","v":5},{"$f":"JAWABAN_PG!H103","v":5},{"$f":"JAWABAN_PG!I103","v":5},{"$f":"JAWABAN_PG!J103","v":5},{"$f":"JAWABAN_PG!K103","v":0},{"$f":"JAWABAN_PG!L103","v":0},{"$f":"JAWABAN_PG!M103","v":0},{"$f":"JAWABAN_PG!N103","v":0},{"$f":"JAWABAN_PG!O103","v":0},{"$f":"JAWABAN_PG!P103","v":5},{"$f":"JAWABAN_PG!Q103","v":5},{"$f":"JAWABAN_PG!R103","v":0},{"$f":"JAWABAN_PG!S103","v":0},{"$f":"JAWABAN_PG!T103","v":0},{"$f":"JAWABAN_PG!U103","v":5},{"$f":"JAWABAN_PG!V103","v":5},{"$f":"JAWABAN_PG!W103","v":5},{"$f":"JAWABAN_PG!X103","v":""},{"$f":"JAWABAN_PG!Y103","v":""},{"$f":"JAWABAN_PG!Z103","v":""},{"$f":"JAWABAN_PG!AA103","v":""},{"$f":"JAWABAN_PG!AB103","v":""},{"$f":"JAWABAN_PG!AC103","v":""},{"$f":"JAWABAN_PG!AD103","v":""},{"$f":"JAWABAN_PG!AE103","v":""},{"$f":"JAWABAN_PG!AF103","v":""},{"$f":"JAWABAN_PG!AG103","v":""},{"$f":"JAWABAN_PG!AH103","v":""},{"$f":"JAWABAN_PG!AI103","v":""},{"$f":"JAWABAN_PG!AJ103","v":""},{"$f":"JAWABAN_PG!AK103","v":""},{"$f":"JAWABAN_PG!AL103","v":""},{"$f":"JAWABAN_PG!AM103","v":""},{"$f":"JAWABAN_PG!AN103","v":""},{"$f":"JAWABAN_PG!AO103","v":""},{"$f":"JAWABAN_PG!AP103","v":""},{"$f":"JAWABAN_PG!AQ103","v":""},{"$f":"JAWABAN_PG!AR103","v":""},{"$f":"JAWABAN_PG!AS103","v":""},{"$f":"JAWABAN_PG!AT103","v":""},{"$f":"JAWABAN_PG!AU103","v":""},{"$f":"JAWABAN_PG!AV103","v":""},{"$f":"JAWABAN_PG!AW103","v":""},{"$f":"JAWABAN_PG!AX103","v":""},{"$f":"JAWABAN_PG!AY103","v":""},{"$f":"JAWABAN_PG!AZ103","v":""},{"$f":"JAWABAN_PG!BA103","v":""},45,{"$f":"IF(BB14>=DATA!$G$15,\"TUNTAS\",\"BELUM TUNTAS\")","v":"BELUM TUNTAS"}]
[8,{"$f":"IF(VALUE(DATA!B13)=0, \"\", TEXT(VALUE(DATA!B13), REPT(\"0\", LEN(DATA!B13))))","v":"0097769415"},{"$f":"IF(DATA!C13=\"\",\"\",DATA!C13)","v":"DEIS SANCI"},{"$f":"JAWABAN_PG!D104","v":0},{"$f":"JAWABAN_PG!E104","v":5},{"$f":"JAWABAN_PG!F104","v":0},{"$f":"JAWABAN_PG!G104","v":0},{"$f":"JAWABAN_PG!H104","v":5},{"$f":"JAWABAN_PG!I104","v":5},{"$f":"JAWABAN_PG!J104","v":5},{"$f":"JAWABAN_PG!K104","v":5},{"$f":"JAWABAN_PG!L104","v":0},{"$f":"JAWABAN_PG!M104","v":5},{"$f":"JAWABAN_PG!N104","v":0},{"$f":"JAWABAN_PG!O104","v":0},{"$f":"JAWABAN_PG!P104","v":5},{"$f":"JAWABAN_PG!Q104","v":5},{"$f":"JAWABAN_PG!R104","v":5},{"$f":"JAWABAN_PG!S104","v":0},{"$f":"JAWABAN_PG!T104","v":0},{"$f":"JAWABAN_PG!U104","v":5},{"$f":"JAWABAN_PG!V104","v":5},{"$f":"JAWABAN_PG!W104","v":5},{"$f":"JAWABAN_PG!X104","v":""},{"$f":"JAWABAN_PG!Y104","v":""},{"$f":"JAWABAN_PG!Z104","v":""},{"$f":"JAWABAN_PG!AA104","v":""},{"$f":"JAWABAN_PG!AB104","v":""},{"$f":"JAWABAN_PG!AC104","v":""},{"$f":"JAWABAN_PG!AD104","v":""},{"$f":"JAWABAN_PG!AE104","v":""},{"$f":"JAWABAN_PG!AF104","v":""},{"$f":"JAWABAN_PG!AG104","v":""},{"$f":"JAWABAN_PG!AH104","v":""},{"$f":"JAWABAN_PG!AI104","v":""},{"$f":"JAWABAN_PG!AJ104","v":""},{"$f":"JAWABAN_PG!AK104","v":""},{"$f":"JAWABAN_PG!AL104","v":""},{"$f":"JAWABAN_PG!AM104","v":""},{"$f":"JAWABAN_PG!AN104","v":""},{"$f":"JAWABAN_PG!AO104","v":""},{"$f":"JAWABAN_PG!AP104","v":""},{"$f":"JAWABAN_PG!AQ104","v":""},{"$f":"JAWABAN_PG!AR104","v":""},{"$f":"JAWABAN_PG!AS104","v":""},{"$f":"JAWABAN_PG!AT104","v":""},{"$f":"JAWABAN_PG!AU104","v":""},{"$f":"JAWABAN_PG!AV104","v":""},{"$f":"JAWABAN_PG!AW104","v":""},{"$f":"JAWABAN_PG!AX104","v":""},{"$f":"JAWABAN_PG!AY104","v":""},{"$f":"JAWABAN_PG!AZ104","v":""},{"$f":"JAWABAN_PG!BA104","v":""},60,{"$f":"IF(BB15>=DATA!$G$15,\"TUNTAS\",\"BELUM TUNTAS\")","v":"BELUM TUNTAS"}]
[9,{"$f":"IF(VALUE(DATA!B14)=0, \"\", TEXT(VALUE(DATA!B14), REPT(\"0\", LEN(DATA!B14))))","v":"0073609592"},{"$f":"IF(DATA!C14=\"\",\"\",DATA!C14)","v":"DIANA MARWAH"},{"$f":"JAWABAN_PG!D105","v":0},{"$f":"JAWABAN_PG!E105","v":5},{"$f":"JAWABAN_PG!F105","v":5},{"$f":"JAWABAN_PG!G105","v":0},{"$f":"JAWABAN_PG!H105","v":5},{"$f":"JAWABAN_PG!I105","v":5},{"$f":"JAWABAN_PG!J105","v":5},{"$f":"JAWABAN_PG!K105","v":0},{"$f":"JAWABAN_PG!L105","v":0},{"$f":"JAWABAN_PG!M105","v":0},{"$f":"JAWABAN_PG!N105","v":5},{"$f":"JAWABAN_PG!O105","v":0},{"$f":"JAWABAN_PG!P105","v":5},{"$f":"JAWABAN_PG!Q105","v":5},{"$f":"JAWABAN_PG!R105","v":5},{"$f":"JAWABAN_PG!S105","v":5},{"$f":"JAWABAN_PG!T105","v":0},{"$f":"JAWABAN_PG!U105","v":5},{"$f":"JAWABAN_PG!V105","v":5},{"$f":"JAWABAN_PG!W105","v":5},{"$f":"JAWABAN_PG!X105","v":""},{"$f":"JAWABAN_PG!Y105","v":""},{"$f":"JAWABAN_PG!Z105","v":""},{"$f":"JAWABAN_PG!AA105","v":""},{"$f":"JAWABAN_PG!AB105","v":""},{"$f":"JAWABAN_PG!AC105","v":""},{"$f":"JAWABAN_PG!AD105","v":""},{"$f":"JAWABAN_PG!AE105","v":""},{"$f":"JAWABAN_PG!AF105","v":""},{"$f":"JAWABAN_PG!AG105","v":""},{"$f":"JAWABAN_PG!AH105","v":""},{"$f":"JAWABAN_PG!AI105","v":""},{"$f":"JAWABAN_PG!AJ105","v":""},{"$f":"JAWABAN_PG!AK105","v":""},{"$f":"JAWABAN_PG!AL105","v":""},{"$f":"JAWABAN_PG!AM105","v":""},{"$f":"JAWABAN_PG!AN105","v":""},{"$f":"JAWABAN_PG!AO105","v":""},{"$f":"JAWABAN_PG!AP105","v":""},{"$f":"JAWABAN_PG!AQ105","v":""},{"$f":"JAWABAN_PG!AR105","v":""},{"$f":"JAWABAN_PG!AS105","v":""},{"$f":"JAWABAN_PG!AT105","v":""},{"$f":"JAWABAN_PG!AU105","v":""},{"$f":"JAWABAN_PG!AV105","v":""},{"$f":"JAWABAN_PG!AW105","v":""},{"$f":"JAWABAN_PG!AX105","v":""},{"$f":"JAWABAN_PG!AY105","v":""},{"$f":"JAWABAN_PG!AZ105","v":""},{"$f":"JAWABAN_PG!BA105","v":""},65,{"$f":"IF(BB16>=DATA!$G$15,\"TUNTAS\",\"BELUM TUNTAS\")","v":"BELUM TUNTAS"}]
[10,{"$f":"IF(VALUE(DATA!B15)=0, \"\", TEXT(VALUE(DATA!B15), REPT(\"0\", LEN(DATA!B15))))","v":"0093260667"},{"$f":"IF(DATA!C15=\"\",\"\",DATA!C15)","v":"ELEN PUSPITA SARI"},{"$f":"JAWABAN_PG!D106","v":0},{"$f":"JAWABAN_PG!E106","v":5},{"$f":"JAWABAN_PG!F106","v":5},{"$f":"JAWABAN_PG!G106","v":5},{"$f":"JAWABAN_PG!H106","v":5},{"$f":"JAWABAN_PG!I106","v":5},{"$f":"JAWABAN_PG!J106","v":5},{"$f":"JAWABAN_PG!K106","v":5},{"$f":"JAWABAN_PG!L106","v":0},{"$f":"JAWABAN_PG!M106","v":5},{"$f":"JAWABAN_PG!N106","v":5},{"$f":"JAWABAN_PG!O106","v":0},{"$f":"JAWABAN_PG!P106","v":5},{"$f":"JAWABAN_PG!Q106","v":5},{"$f":"JAWABAN_PG!R106","v":0},{"$f":"JAWABAN_PG!S106","v":5},{"$f":"JAWABAN_PG!T106","v":0},{"$f":"JAWABAN_PG!U106","v":5},{"$f":"JAWABAN_PG!V106","v":5},{"$f":"JAWABAN_PG!W106","v":5},{"$f":"JAWABAN_PG!X106","v":""},{"$f":"JAWABAN_PG!Y106","v":""},{"$f":"JAWABAN_PG!Z106","v":""},{"$f":"JAWABAN_PG!AA106","v":""},{"$f":"JAWABAN_PG!AB106","v":""},{"$f":"JAWABAN_PG!AC106","v":""},{"$f":"JAWABAN_PG!AD106","v":""},{"$f":"JAWABAN_PG!AE106","v":""},{"$f":"JAWABAN_PG!AF106","v":""},{"$f":"JAWABAN_PG!AG106","v":""},{"$f":"JAWABAN_PG!AH106","v":""},{"$f":"JAWABAN_PG!AI106","v":""},{"$f":"JAWABAN_PG!AJ106","v":""},{"$f":"JAWABAN_PG!AK106","v":""},{"$f":"JAWABAN_PG!AL106","v":""},{"$f":"JAWABAN_PG!AM106","v":""},{"$f":"JAWABAN_PG!AN106","v":""},{"$f":"JAWABAN_PG!AO106","v":""},{"$f":"JAWABAN_PG!AP106","v":""},{"$f":"JAWABAN_PG!AQ106","v":""},{"$f":"JAWABAN_PG!AR106","v":""},{"$f":"JAWABAN_PG!AS106","v":""},{"$f":"JAWABAN_PG!AT106","v":""},{"$f":"JAWABAN_PG!AU106","v":""},{"$f":"JAWABAN_PG!AV106","v":""},{"$f":"JAWABAN_PG!AW106","v":""},{"$f":"JAWABAN_PG!AX106","v":""},{"$f":"JAWABAN_PG!AY106","v":""},{"$f":"JAWABAN_PG!AZ106","v":""},{"$f":"JAWABAN_PG!BA106","v":""},75,{"$f":"IF(BB17>=DATA!$G$15,\"TUNTAS\",\"BELUM TUNTAS\")","v":"TUNTAS"}]
[11,{"$f":"IF(VALUE(DATA!B16)=0, \"\", TEXT(VALUE(DATA!B16), REPT(\"0\", LEN(DATA!B16))))","v":"3094067902"},{"$f":"IF(DATA!C16=\"\",\"\",DATA!C16)","v":"FEBRIAN MUHAMAD YAHPA"},{"$f":"JAWABAN_PG!D107","v":0},{"$f":"JAWABAN_PG!E107","v":0},{"$f":"JAWABAN_PG!F107","v":0},{"$f":"JAWABAN_PG!G107","v":0},{"$f":"JAWABAN_PG!H107","v":5},{"$f":"JAWABAN_PG!I107","v":5},{"$f":"JAWABAN_PG!J107","v":5},{"$f":"JAWABAN_PG!K107","v":5},{"$f":"JAWABAN_PG!L107","v":0},{"$f":"JAWABAN_PG!M107","v":5},{"$f":"JAWABAN_PG!N107","v":0},{"$f":"JAWABAN_PG!O107","v":0},{"$f":"JAWABAN_PG!P107","v":5},{"$f":"JAWABAN_PG!Q107","v":0},{"$f":"JAWABAN_PG!R107","v":0},{"$f":"JAWABAN_PG!S107","v":0},{"$f":"JAWABAN_PG!T107","v":0},{"$f":"JAWABAN_PG!U107","v":0},{"$f":"JAWABAN_PG!V107","v":0},{"$f":"JAWABAN_PG!W107","v":5},{"$f":"JAWABAN_PG!X107","v":""},{"$f":"JAWABAN_PG!Y107","v":""},{"$f":"JAWABAN_PG!Z107","v":""},{"$f":"JAWABAN_PG!AA107","v":""},{"$f":"JAWABAN_PG!AB107","v":""},{"$f":"JAWABAN_PG!AC107","v":""},{"$f":"JAWABAN_PG!AD107","v":""},{"$f":"JAWABAN_PG!AE107","v":""},{"$f":"JAWABAN_PG!AF107","v":""},{"$f":"JAWABAN_PG!AG107","v":""},{"$f":"JAWABAN_PG!AH107","v":""},{"$f":"JAWABAN_PG!AI107","v":""},{"$f":"JAWABAN_PG!AJ107","v":""},{"$f":"JAWABAN_PG!AK107","v":""},{"$f":"JAWABAN_PG!AL107","v":""},{"$f":"JAWABAN_PG!AM107","v":""},{"$f":"JAWABAN_PG!AN107","v":""},{"$f":"JAWABAN_PG!AO107","v":""},{"$f":"JAWABAN_PG!AP107","v":""},{"$f":"JAWABAN_PG!AQ107","v":""},{"$f":"JAWABAN_PG!AR107","v":""},{"$f":"JAWABAN_PG!AS107","v":""},{"$f":"JAWABAN_PG!AT107","v":""},{"$f":"JAWABAN_PG!AU107","v":""},{"$f":"JAWABAN_PG!AV107","v":""},{"$f":"JAWABAN_PG!AW107","v":""},{"$f":"JAWABAN_PG!AX107","v":""},{"$f":"JAWABAN_PG!AY107","v":""},{"$f":"JAWABAN_PG!AZ107","v":""},{"$f":"JAWABAN_PG!BA107","v":""},35,{"$f":"IF(BB18>=DATA!$G$15,\"TUNTAS\",\"BELUM TUNTAS\")","v":"BELUM TUNTAS"}]
[12,{"$f":"IF(VALUE(DATA!B17)=0, \"\", TEXT(VALUE(DATA!B17), REPT(\"0\", LEN(DATA!B17))))","v":"03090982486"},{"$f":"IF(DATA!C17=\"\",\"\",DATA!C17)","v":"HIKMAL ANGGIA PRATAMA"},{"$f":"JAWABAN_PG!D108","v":0},{"$f":"JAWABAN_PG!E108","v":5},{"$f":"JAWABAN_PG!F108","v":5},{"$f":"JAWABAN_PG!G108","v":0},{"$f":"JAWABAN_PG!H108","v":5},{"$f":"JAWABAN_PG!I108","v":5},{"$f":"JAWABAN_PG!J108","v":0},{"$f":"JAWABAN_PG!K108","v":5},{"$f":"JAWABAN_PG!L108","v":0},{"$f":"JAWABAN_PG!M108","v":5},{"$f":"JAWABAN_PG!N108","v":5},{"$f":"JAWABAN_PG!O108","v":0},{"$f":"JAWABAN_PG!P108","v":5},{"$f":"JAWABAN_PG!Q108","v":5},{"$f":"JAWABAN_PG!R108","v":0},{"$f":"JAWABAN_PG!S108","v":0},{"$f":"JAWABAN_PG!T108","v":0},{"$f":"JAWABAN_PG!U108","v":5},{"$f":"JAWABAN_PG!V108","v":5},{"$f":"JAWABAN_PG!W108","v":5},{"$f":"JAWABAN_PG!X108","v":""},{"$f":"JAWABAN_PG!Y108","v":""},{"$f":"JAWABAN_PG!Z108","v":""},{"$f":"JAWABAN_PG!AA108","v":""},{"$f":"JAWABAN_PG!AB108","v":""},{"$f":"JAWABAN_PG!AC108","v":""},{"$f":"JAWABAN_PG!AD108","v":""},{"$f":"JAWABAN_PG!AE108","v":""},{"$f":"JAWABAN_PG!AF108","v":""},{"$f":"JAWABAN_PG!AG108","v":""},{"$f":"JAWABAN_PG!AH108","v":""},{"$f":"JAWABAN_PG!AI108","v":""},{"$f":"JAWABAN_PG!AJ108","v":""},{"$f":"JAWABAN_PG!AK108","v":""},{"$f":"JAWABAN_PG!AL108","v":""},{"$f":"JAWABAN_PG!AM108","v":""},{"$f":"JAWABAN_PG!AN108","v":""},{"$f":"JAWABAN_PG!AO108","v":""},{"$f":"JAWABAN_PG!AP108","v":""},{"$f":"JAWABAN_PG!AQ108","v":""},{"$f":"JAWABAN_PG!AR108","v":""},{"$f":"JAWABAN_PG!AS108","v":""},{"$f":"JAWABAN_PG!AT108","v":""},{"$f":"JAWABAN_PG!AU108","v":""},{"$f":"JAWABAN_PG!AV108","v":""},{"$f":"JAWABAN_PG!AW108","v":""},{"$f":"JAWABAN_PG!AX108","v":""},{"$f":"JAWABAN_PG!AY108","v":""},{"$f":"JAWABAN_PG!AZ108","v":""},{"$f":"JAWABAN_PG!BA108","v":""},60,{"$f":"IF(BB19>=DATA!$G$15,\"TUNTAS\",\"BELUM TUNTAS\")","v":"BELUM TUNTAS"}]
[13,{"$f":"IF(VALUE(DATA!B18)=0, \"\", TEXT(VALUE(DATA!B18), REPT(\"0\", LEN(DATA!B18))))","v":"0098360161"},{"$f":"IF(DATA!C18=\"\",\"\",DATA!C18)","v":"IKHSAN FAUZI JULIANA"},{"$f":"JAWABAN_PG!D109","v":0},{"$f":"JAWABAN_PG!E109","v":0},{"$f":"JAWABAN_PG!F109","v":0},{"$f":"JAWABAN_PG!G109","v":0},{"$f":"JAWABAN_PG!H109","v":5},{"$f":"JAWABAN_PG!I109","v":5},{"$f":"JAWABAN_PG!J109","v":5},{"$f":"JAWABAN_PG!K109","v":5},{"$f":"JAWABAN_PG!L109","v":0},{"$f":"JAWABAN_PG!M109","v":0},{"$f":"JAWABAN_PG!N109","v":5},{"$f":"JAWABAN_PG!O109","v":0},{"$f":"JAWABAN_PG!P109","v":5},{"$f":"JAWABAN_PG!Q109","v":5},{"$f":"JAWABAN_PG!R109","v":0},{"$f":"JAWABAN_PG!S109","v":0},{"$f":"JAWABAN_PG!T109","v":0},{"$f":"JAWABAN_PG!U109","v":5},{"$f":"JAWABAN_PG!V109","v":5},{"$f":"JAWABAN_PG!W109","v":5},{"$f":"JAWABAN_PG!X109","v":""},{"$f":"JAWABAN_PG!Y109","v":""},{"$f":"JAWABAN_PG!Z109","v":""},{"$f":"JAWABAN_PG!AA109","v":""},{"$f":"JAWABAN_PG!AB109","v":""},{"$f":"JAWABAN_PG!AC109","v":""},{"$f":"JAWABAN_PG!AD109","v":""},{"$f":"JAWABAN_PG!AE109","v":""},{"$f":"JAWABAN_PG!AF109","v":""},{"$f":"JAWABAN_PG!AG109","v":""},{"$f":"JAWABAN_PG!AH109","v":""},{"$f":"JAWABAN_PG!AI109","v":""},{"$f":"JAWABAN_PG!AJ109","v":""},{"$f":"JAWABAN_PG!AK109","v":""},{"$f":"JAWABAN_PG!AL109","v":""},{"$f":"JAWABAN_PG!AM109","v":""},{"$f":"JAWABAN_PG!AN109","v":""},{"$f":"JAWABAN_PG!AO109","v":""},{"$f":"JAWABAN_PG!AP109","v":""},{"$f":"JAWABAN_PG!AQ109","v":""},{"$f":"JAWABAN_PG!AR109","v":""},{"$f":"JAWABAN_PG!AS109","v":""},{"$f":"JAWABAN_PG!AT109","v":""},{"$f":"JAWABAN_PG!AU109","v":""},{"$f":"JAWABAN_PG!AV109","v":""},{"$f":"JAWABAN_PG!AW109","v":""},{"$f":"JAWABAN_PG!AX109","v":""},{"$f":"JAWABAN_PG!AY109","v":""},{"$f":"JAWABAN_PG!AZ109","v":""},{"$f":"JAWABAN_PG!BA109","v":""},50,{"$f":"IF(BB20>=DATA!$G$15,\"TUNTAS\",\"BELUM TUNTAS\")","v":"BELUM TUNTAS"}]
[14,{"$f":"IF(VALUE(DATA!B19)=0, \"\", TEXT(VALUE(DATA!B19), REPT(\"0\", LEN(DATA!B19))))","v":"0092391673"},{"$f":"IF(DATA!C19=\"\",\"\",DATA!C19)","v":"INDRI"},{"$f":"JAWABAN_PG!D110","v":0},{"$f":"JAWABAN_PG!E110","v":5},{"$f":"JAWABAN_PG!F110","v":5},{"$f":"JAWABAN_PG!G110","v":0},{"$f":"JAWABAN_PG!H110","v":5},{"$f":"JAWABAN_PG!I110","v":5},{"$f":"JAWABAN_PG!J110","v":5},{"$f":"JAWABAN_PG!K110","v":5},{"$f":"JAWABAN_PG!L110","v":0},{"$f":"JAWABAN_PG!M110","v":5},{"$f":"JAWABAN_PG!N110","v":5},{"$f":"JAWABAN_PG!O110","v":0},{"$f":"JAWABAN_PG!P110","v":5},{"$f":"JAWABAN_PG!Q110","v":5},{"$f":"JAWABAN_PG!R110","v":0},{"$f":"JAWABAN_PG!S110","v":0},{"$f":"JAWABAN_PG!T110","v":0},{"$f":"JAWABAN_PG!U110","v":0},{"$f":"JAWABAN_PG!V110","v":5},{"$f":"JAWABAN_PG!W110","v":5},{"$f":"JAWABAN_PG!X110","v":""},{"$f":"JAWABAN_PG!Y110","v":""},{"$f":"JAWABAN_PG!Z110","v":""},{"$f":"JAWABAN_PG!AA110","v":""},{"$f":"JAWABAN_PG!AB110","v":""},{"$f":"JAWABAN_PG!AC110","v":""},{"$f":"JAWABAN_PG!AD110","v":""},{"$f":"JAWABAN_PG!AE110","v":""},{"$f":"JAWABAN_PG!AF110","v":""},{"$f":"JAWABAN_PG!AG110","v":""},{"$f":"JAWABAN_PG!AH110","v":""},{"$f":"JAWABAN_PG!AI110","v":""},{"$f":"JAWABAN_PG!AJ110","v":""},{"$f":"JAWABAN_PG!AK110","v":""},{"$f":"JAWABAN_PG!AL110","v":""},{"$f":"JAWABAN_PG!AM110","v":""},{"$f":"JAWABAN_PG!AN110","v":""},{"$f":"JAWABAN_PG!AO110","v":""},{"$f":"JAWABAN_PG!AP110","v":""},{"$f":"JAWABAN_PG!AQ110","v":""},{"$f":"JAWABAN_PG!AR110","v":""},{"$f":"JAWABAN_PG!AS110","v":""},{"$f":"JAWABAN_PG!AT110","v":""},{"$f":"JAWABAN_PG!AU110","v":""},{"$f":"JAWABAN_PG!AV110","v":""},{"$f":"JAWABAN_PG!AW110","v":""},{"$f":"JAWABAN_PG!AX110","v":""},{"$f":"JAWABAN_PG!AY110","v":""},{"$f":"JAWABAN_PG!AZ110","v":""},{"$f":"JAWABAN_PG!BA110","v":""},60,{"$f":"IF(BB21>=DATA!$G$15,\"TUNTAS\",\"BELUM TUNTAS\")","v":"BELUM TUNTAS"}]
[15,{"$f":"IF(VALUE(DATA!B20)=0, \"\", TEXT(VALUE(DATA!B20), REPT(\"0\", LEN(DATA!B20))))","v":"0097558410"},{"$f":"IF(DATA!C20=\"\",\"\",DATA!C20)","v":"IRSAN EFENDI"},{"$f":"JAWABAN_PG!D111","v":0},{"$f":"JAWABAN_PG!E111","v":5},{"$f":"JAWABAN_PG!F111","v":5},{"$f":"JAWABAN_PG!G111","v":0},{"$f":"JAWABAN_PG!H111","v":5},{"$f":"JAWABAN_PG!I111","v":5},{"$f":"JAWABAN_PG!J111","v":5},{"$f":"JAWABAN_PG!K111","v":0},{"$f":"JAWABAN_PG!L111","v":0},{"$f":"JAWABAN_PG!M111","v":0},{"$f":"JAWABAN_PG!N111","v":5},{"$f":"JAWABAN_PG!O111","v":0},{"$f":"JAWABAN_PG!P111","v":5},{"$f":"JAWABAN_PG!Q111","v":5},{"$f":"JAWABAN_PG!R111","v":0},{"$f":"JAWABAN_PG!S111","v":0},{"$f":"JAWABAN_PG!T111","v":0},{"$f":"JAWABAN_PG!U111","v":5},{"$f":"JAWABAN_PG!V111","v":5},{"$f":"JAWABAN_PG!W111","v":5},{"$f":"JAWABAN_PG!X111","v":""},{"$f":"JAWABAN_PG!Y111","v":""},{"$f":"JAWABAN_PG!Z111","v":""},{"$f":"JAWABAN_PG!AA111","v":""},{"$f":"JAWABAN_PG!AB111","v":""},{"$f":"JAWABAN_PG!AC111","v":""},{"$f":"JAWABAN_PG!AD111","v":""},{"$f":"JAWABAN_PG!AE111","v":""},{"$f":"JAWABAN_PG!AF111","v":""},{"$f":"JAWABAN_PG!AG111","v":""},{"$f":"JAWABAN_PG!AH111","v":""},{"$f":"JAWABAN_PG!AI111","v":""},{"$f":"JAWABAN_PG!AJ111","v":""},{"$f":"JAWABAN_PG!AK111","v":""},{"$f":"JAWABAN_PG!AL111","v":""},{"$f":"JAWABAN_PG!AM111","v":""},{"$f":"JAWABAN_PG!AN111","v":""},{"$f":"JAWABAN_PG!AO111","v":""},{"$f":"JAWABAN_PG!AP111","v":""},{"$f":"JAWABAN_PG!AQ111","v":""},{"$f":"JAWABAN_PG!AR111","v":""},{"$f":"JAWABAN_PG!AS111","v":""},{"$f":"JAWABAN_PG!AT111","v":""},{"$f":"JAWABAN_PG!AU111","v":""},{"$f":"JAWABAN_PG!AV111","v":""},{"$f":"JAWABAN_PG!AW111","v":""},{"$f":"JAWABAN_PG!AX111","v":""},{"$f":"JAWABAN_PG!AY111","v":""},{"$f":"JAWABAN_PG!AZ111","v":""},{"$f":"JAWABAN_PG!BA111","v":""},55,{"$f":"IF(BB22>=DATA!$G$15,\"TUNTAS\",\"BELUM TUNTAS\")","v":"BELUM TUNTAS"}]
[16,{"$f":"IF(VALUE(DATA!B21)=0, \"\", TEXT(VALUE(DATA!B21), REPT(\"0\", LEN(DATA!B21))))","v":"0107569281"},{"$f":"IF(DATA!C21=\"\",\"\",DATA!C21)","v":"MAYANG SRI WULAN"},{"$f":"JAWABAN_PG!D112","v":0},{"$f":"JAWABAN_PG!E112","v":5},{"$f":"JAWABAN_PG!F112","v":5},{"$f":"JAWABAN_PG!G112","v":0},{"$f":"JAWABAN_PG!H112","v":5},{"$f":"JAWABAN_PG!I112","v":5},{"$f":"JAWABAN_PG!J112","v":5},{"$f":"JAWABAN_PG!K112","v":0},{"$f":"JAWABAN_PG!L112","v":0},{"$f":"JAWABAN_PG!M112","v":0},{"$f":"JAWABAN_PG!N112","v":5},{"$f":"JAWABAN_PG!O112","v":0},{"$f":"JAWABAN_PG!P112","v":5},{"$f":"JAWABAN_PG!Q112","v":5},{"$f":"JAWABAN_PG!R112","v":0},{"$f":"JAWABAN_PG!S112","v":0},{"$f":"JAWABAN_PG!T112","v":0},{"$f":"JAWABAN_PG!U112","v":5},{"$f":"JAWABAN_PG!V112","v":5},{"$f":"JAWABAN_PG!W112","v":5},{"$f":"JAWABAN_PG!X112","v":""},{"$f":"JAWABAN_PG!Y112","v":""},{"$f":"JAWABAN_PG!Z112","v":""},{"$f":"JAWABAN_PG!AA112","v":""},{"$f":"JAWABAN_PG!AB112","v":""},{"$f":"JAWABAN_PG!AC112","v":""},{"$f":"JAWABAN_PG!AD112","v":""},{"$f":"JAWABAN_PG!AE112","v":""},{"$f":"JAWABAN_PG!AF112","v":""},{"$f":"JAWABAN_PG!AG112","v":""},{"$f":"JAWABAN_PG!AH112","v":""},{"$f":"JAWABAN_PG!AI112","v":""},{"$f":"JAWABAN_PG!AJ112","v":""},{"$f":"JAWABAN_PG!AK112","v":""},{"$f":"JAWABAN_PG!AL112","v":""},{"$f":"JAWABAN_PG!AM112","v":""},{"$f":"JAWABAN_PG!AN112","v":""},{"$f":"JAWABAN_PG!AO112","v":""},{"$f":"JAWABAN_PG!AP112","v":""},{"$f":"JAWABAN_PG!AQ112","v":""},{"$f":"JAWABAN_PG!AR112","v":""},{"$f":"JAWABAN_PG!AS112","v":""},{"$f":"JAWABAN_PG!AT112","v":""},{"$f":"JAWABAN_PG!AU112","v":""},{"$f":"JAWABAN_PG!AV112","v":""},{"$f":"JAWABAN_PG!AW112","v":""},{"$f":"JAWABAN_PG!AX112","v":""},{"$f":"JAWABAN_PG!AY112","v":""},{"$f":"JAWABAN_PG!AZ112","v":""},{"$f":"JAWABAN_PG!BA112","v":""},55,{"$f":"IF(BB23>=DATA!$G$15,\"TUNTAS\",\"BELUM TUNTAS\")","v":"BELUM TUNTAS"}]
[17,{"$f":"IF(VALUE(DATA!B22)=0, \"\", TEXT(VALUE(DATA!B22), REPT(\"0\", LEN(DATA!B22))))","v":"0093343105"},{"$f":"IF(DATA!C22=\"\",\"\",DATA!C22)","v":"NEYLLA AGUSTIN"},{"$f":"JAWABAN_PG!D113","v":0},{"$f":"JAWABAN_PG!E113","v":5},{"$f":"JAWABAN_PG!F113","v":5},{"$f":"JAWABAN_PG!G113","v":0},{"$f":"JAWABAN_PG!H113","v":5},{"$f":"JAWABAN_PG!I113","v":5},{"$f":"JAWABAN_PG!J113","v":5},{"$f":"JAWABAN_PG!K113","v":0},{"$f":"JAWABAN_PG!L113","v":0},{"$f":"JAWABAN_PG!M113","v":5},{"$f":"JAWABAN_PG!N113","v":5},{"$f":"JAWABAN_PG!O113","v":0},{"$f":"JAWABAN_PG!P113","v":5},{"$f":"JAWABAN_PG!Q113","v":5},{"$f":"JAWABAN_PG!R113","v":5},{"$f":"JAWABAN_PG!S113","v":5},{"$f":"JAWABAN_PG!T113","v":0},{"$f":"JAWABAN_PG!U113","v":5},{"$f":"JAWABAN_PG!V113","v":5},{"$f":"JAWABAN_PG!W113","v":5},{"$f":"JAWABAN_PG!X113","v":""},{"$f":"JAWABAN_PG!Y113","v":""},{"$f":"JAWABAN_PG!Z113","v":""},{"$f":"JAWABAN_PG!AA113","v":""},{"$f":"JAWABAN_PG!AB113","v":""},{"$f":"JAWABAN_PG!AC113","v":""},{"$f":"JAWABAN_PG!AD113","v":""},{"$f":"JAWABAN_PG!AE113","v":""},{"$f":"JAWABAN_PG!AF113","v":""},{"$f":"JAWABAN_PG!AG113","v":""},{"$f":"JAWABAN_PG!AH113","v":""},{"$f":"JAWABAN_PG!AI113","v":""},{"$f":"JAWABAN_PG!AJ113","v":""},{"$f":"JAWABAN_PG!AK113","v":""},{"$f":"JAWABAN_PG!AL113","v":""},{"$f":"JAWABAN_PG!AM113","v":""},{"$f":"JAWABAN_PG!AN113","v":""},{"$f":"JAWABAN_PG!AO113","v":""},{"$f":"JAWABAN_PG!AP113","v":""},{"$f":"JAWABAN_PG!AQ113","v":""},{"$f":"JAWABAN_PG!AR113","v":""},{"$f":"JAWABAN_PG!AS113","v":""},{"$f":"JAWABAN_PG!AT113","v":""},{"$f":"JAWABAN_PG!AU113","v":""},{"$f":"JAWABAN_PG!AV113","v":""},{"$f":"JAWABAN_PG!AW113","v":""},{"$f":"JAWABAN_PG!AX113","v":""},{"$f":"JAWABAN_PG!AY113","v":""},{"$f":"JAWABAN_PG!AZ113","v":""},{"$f":"JAWABAN_PG!BA113","v":""},70,{"$f":"IF(BB24>=DATA!$G$15,\"TUNTAS\",\"BELUM TUNTAS\")","v":"BELUM TUNTAS"}]
[18,{"$f":"IF(VALUE(DATA!B23)=0, \"\", TEXT(VALUE(DATA!B23), REPT(\"0\", LEN(DATA!B23))))","v":"3094158453"},{"$f":"IF(DATA!C23=\"\",\"\",DATA!C23)","v":"NURAENI"},{"$f":"JAWABAN_PG!D114","v":0},{"$f":"JAWABAN_PG!E114","v":0},{"$f":"JAWABAN_PG!F114","v":0},{"$f":"JAWABAN_PG!G114","v":0},{"$f":"JAWABAN_PG!H114","v":5},{"$f":"JAWABAN_PG!I114","v":5},{"$f":"JAWABAN_PG!J114","v":5},{"$f":"JAWABAN_PG!K114","v":0},{"$f":"JAWABAN_PG!L114","v":0},{"$f":"JAWABAN_PG!M114","v":5},{"$f":"JAWABAN_PG!N114","v":5},{"$f":"JAWABAN_PG!O114","v":0},{"$f":"JAWABAN_PG!P114","v":5},{"$f":"JAWABAN_PG!Q114","v":5},{"$f":"JAWABAN_PG!R114","v":0},{"$f":"JAWABAN_PG!S114","v":0},{"$f":"JAWABAN_PG!T114","v":0},{"$f":"JAWABAN_PG!U114","v":5},{"$f":"JAWABAN_PG!V114","v":5},{"$f":"JAWABAN_PG!W114","v":5},{"$f":"JAWABAN_PG!X114","v":""},{"$f":"JAWABAN_PG!Y114","v":""},{"$f":"JAWABAN_PG!Z114","v":""},{"$f":"JAWABAN_PG!AA114","v":""},{"$f":"JAWABAN_PG!AB114","v":""},{"$f":"JAWABAN_PG!AC114","v":""},{"$f":"JAWABAN_PG!AD114","v":""},{"$f":"JAWABAN_PG!AE114","v":""},{"$f":"JAWABAN_PG!AF114","v":""},{"$f":"JAWABAN_PG!AG114","v":""},{"$f":"JAWABAN_PG!AH114","v":""},{"$f":"JAWABAN_PG!AI114","v":""},{"$f":"JAWABAN_PG!AJ114","v":""},{"$f":"JAWABAN_PG!AK114","v":""},{"$f":"JAWABAN_PG!AL114","v":""},{"$f":"JAWABAN_PG!AM114","v":""},{"$f":"JAWABAN_PG!AN114","v":""},{"$f":"JAWABAN_PG!AO114","v":""},{"$f":"JAWABAN_PG!AP114","v":""},{"$f":"JAWABAN_PG!AQ114","v":""},{"$f":"JAWABAN_PG!AR114","v":""},{"$f":"JAWABAN_PG!AS114","v":""},{"$f":"JAWABAN_PG!AT114","v":""},{"$f":"JAWABAN_PG!AU114","v":""},{"$f":"JAWABAN_PG!AV114","v":""},{"$f":"JAWABAN_PG!AW114","v":""},{"$f":"JAWABAN_PG!AX114","v":""},{"$f":"JAWABAN_PG!AY114","v":""},{"$f":"JAWABAN_PG!AZ114","v":""},{"$f":"JAWABAN_PG!BA114","v":""},50,{"$f":"IF(BB25>=DATA!$G$15,\"TUNTAS\",\"BELUM TUNTAS\")","v":"BELUM TUNTAS"}]
[19,{"$f":"IF(VALUE(DATA!B24)=0, \"\", TEXT(VALUE(DATA!B24), REPT(\"0\", LEN(DATA!B24))))","v":"3095543410"},{"$f":"IF(DATA!C24=\"\",\"\",DATA!C24)","v":"NURI NURFATMAH"},{"$f":"JAWABAN_PG!D115","v":0},{"$f":"JAWABAN_PG!E115","v":0},{"$f":"JAWABAN_PG!F115","v":0},{"$f":"JAWABAN_PG!G115","v":0},{"$f":"JAWABAN_PG!H115","v":5},{"$f":"JAWABAN_PG!I115","v":5},{"$f":"JAWABAN_PG!J115","v":5},{"$f":"JAWABAN_PG!K115","v":0},{"$f":"JAWABAN_PG!L115","v":0},{"$f":"JAWABAN_PG!M115","v":5},{"$f":"JAWABAN_PG!N115","v":5},{"$f":"JAWABAN_PG!O115","v":0},{"$f":"JAWABAN_PG!P115","v":5},{"$f":"JAWABAN_PG!Q115","v":5},{"$f":"JAWABAN_PG!R115","v":0},{"$f":"JAWABAN_PG!S115","v":0},{"$f":"JAWABAN_PG!T115","v":0},{"$f":"JAWABAN_PG!U115","v":5},{"$f":"JAWABAN_PG!V115","v":5},{"$f":"JAWABAN_PG!W115","v":5},{"$f":"JAWABAN_PG!X115","v":""},{"$f":"JAWABAN_PG!Y115","v":""},{"$f":"JAWABAN_PG!Z115","v":""},{"$f":"JAWABAN_PG!AA115","v":""},{"$f":"JAWABAN_PG!AB115","v":""},{"$f":"JAWABAN_PG!AC115","v":""},{"$f":"JAWABAN_PG!AD115","v":""},{"$f":"JAWABAN_PG!AE115","v":""},{"$f":"JAWABAN_PG!AF115","v":""},{"$f":"JAWABAN_PG!AG115","v":""},{"$f":"JAWABAN_PG!AH115","v":""},{"$f":"JAWABAN_PG!AI115","v":""},{"$f":"JAWABAN_PG!AJ115","v":""},{"$f":"JAWABAN_PG!AK115","v":""},{"$f":"JAWABAN_PG!AL115","v":""},{"$f":"JAWABAN_PG!AM115","v":""},{"$f":"JAWABAN_PG!AN115","v":""},{"$f":"JAWABAN_PG!AO115","v":""},{"$f":"JAWABAN_PG!AP115","v":""},{"$f":"JAWABAN_PG!AQ115","v":""},{"$f":"JAWABAN_PG!AR115","v":""},{"$f":"JAWABAN_PG!AS115","v":""},{"$f":"JAWABAN_PG!AT115","v":""},{"$f":"JAWABAN_PG!AU115","v":""},{"$f":"JAWABAN_PG!AV115","v":""},{"$f":"JAWABAN_PG!AW115","v":""},{"$f":"JAWABAN_PG!AX115","v":""},{"$f":"JAWABAN_PG!AY115","v":""},{"$f":"JAWABAN_PG!AZ115","v":""},{"$f":"JAWABAN_PG!BA115","v":""},50,{"$f":"IF(BB26>=DATA!$G$15,\"TUNTAS\",\"BELUM TUNTAS\")","v":"BELUM TUNTAS"}]
[20,{"$f":"IF(VALUE(DATA!B25)=0, \"\", TEXT(VALUE(DATA!B25), REPT(\"0\", LEN(DATA!B25))))","v":"0094561223"},{"$f":"IF(DATA!C25=\"\",\"\",DATA!C25)","v":"PIKA AYU AMBARWATI"},{"$f":"JAWABAN_PG!D116","v":0},{"$f":"JAWABAN_PG!E116","v":0},{"$f":"JAWABAN_PG!F116","v":0},{"$f":"JAWABAN_PG!G116","v":0},{"$f":"JAWABAN_PG!H116","v":5},{"$f":"JAWABAN_PG!I116","v":5},{"$f":"JAWABAN_PG!J116","v":5},{"$f":"JAWABAN_PG!K116","v":0},{"$f":"JAWABAN_PG!L116","v":0},{"$f":"JAWABAN_PG!M116","v":0},{"$f":"JAWABAN_PG!N116","v":5},{"$f":"JAWABAN_PG!O116","v":0},{"$f":"JAWABAN_PG!P116","v":5},{"$f":"JAWABAN_PG!Q116","v":5},{"$f":"JAWABAN_PG!R116","v":0},{"$f":"JAWABAN_PG!S116","v":0},{"$f":"JAWABAN_PG!T116","v":0},{"$f":"JAWABAN_PG!U116","v":5},{"$f":"JAWABAN_PG!V116","v":5},{"$f":"JAWABAN_PG!W116","v":5},{"$f":"JAWABAN_PG!X116","v":""},{"$f":"JAWABAN_PG!Y116","v":""},{"$f":"JAWABAN_PG!Z116","v":""},{"$f":"JAWABAN_PG!AA116","v":""},{"$f":"JAWABAN_PG!AB116","v":""},{"$f":"JAWABAN_PG!AC116","v":""},{"$f":"JAWABAN_PG!AD116","v":""},{"$f":"JAWABAN_PG!AE116","v":""},{"$f":"JAWABAN_PG!AF116","v":""},{"$f":"JAWABAN_PG!AG116","v":""},{"$f":"JAWABAN_PG!AH116","v":""},{"$f":"JAWABAN_PG!AI116","v":""},{"$f":"JAWABAN_PG!AJ116","v":""},{"$f":"JAWABAN_PG!AK116","v":""},{"$f":"JAWABAN_PG!AL116","v":""},{"$f":"JAWABAN_PG!AM116","v":""},{"$f":"JAWABAN_PG!AN116","v":""},{"$f":"JAWABAN_PG!AO116","v":""},{"$f":"JAWABAN_PG!AP116","v":""},{"$f":"JAWABAN_PG!AQ116","v":""},{"$f":"JAWABAN_PG!AR116","v":""},{"$f":"JAWABAN_PG!AS116","v":""},{"$f":"JAWABAN_PG!AT116","v":""},{"$f":"JAWABAN_PG!AU116","v":""},{"$f":"JAWABAN_PG!AV116","v":""},{"$f":"JAWABAN_PG!AW116","v":""},{"$f":"JAWABAN_PG!AX116","v":""},{"$f":"JAWABAN_PG!AY116","v":""},{"$f":"JAWABAN_PG!AZ116","v":""},{"$f":"JAWABAN_PG!BA116","v":""},45,{"$f":"IF(BB27>=DATA!$G$15,\"TUNTAS\",\"BELUM TUNTAS\")","v":"BELUM TUNTAS"}]
[21,{"$f":"IF(VALUE(DATA!B26)=0, \"\", TEXT(VALUE(DATA!B26), REPT(\"0\", LEN(DATA!B26))))","v":"0106627089"},{"$f":"IF(DATA!C26=\"\",\"\",DATA!C26)","v":"PUPUT DILA NOPITA SARI"},{"$f":"JAWABAN_PG!D117","v":0},{"$f":"JAWABAN_PG!E117","v":5},{"$f":"JAWABAN_PG!F117","v":5},{"$f":"JAWABAN_PG!G117","v":0},{"$f":"JAWABAN_PG!H117","v":5},{"$f":"JAWABAN_PG!I117","v":5},{"$f":"JAWABAN_PG!J117","v":5},{"$f":"JAWABAN_PG!K117","v":5},{"$f":"JAWABAN_PG!L117","v":0},{"$f":"JAWABAN_PG!M117","v":5},{"$f":"JAWABAN_PG!N117","v":5},{"$f":"JAWABAN_PG!O117","v":0},{"$f":"JAWABAN_PG!P117","v":5},{"$f":"JAWABAN_PG!Q117","v":5},{"$f":"JAWABAN_PG!R117","v":5},{"$f":"JAWABAN_PG!S117","v":5},{"$f":"JAWABAN_PG!T117","v":5},{"$f":"JAWABAN_PG!U117","v":5},{"$f":"JAWABAN_PG!V117","v":5},{"$f":"JAWABAN_PG!W117","v":5},{"$f":"JAWABAN_PG!X117","v":""},{"$f":"JAWABAN_PG!Y117","v":""},{"$f":"JAWABAN_PG!Z117","v":""},{"$f":"JAWABAN_PG!AA117","v":""},{"$f":"JAWABAN_PG!AB117","v":""},{"$f":"JAWABAN_PG!AC117","v":""},{"$f":"JAWABAN_PG!AD117","v":""},{"$f":"JAWABAN_PG!AE117","v":""},{"$f":"JAWABAN_PG!AF117","v":""},{"$f":"JAWABAN_PG!AG117","v":""},{"$f":"JAWABAN_PG!AH117","v":""},{"$f":"JAWABAN_PG!AI117","v":""},{"$f":"JAWABAN_PG!AJ117","v":""},{"$f":"JAWABAN_PG!AK117","v":""},{"$f":"JAWABAN_PG!AL117","v":""},{"$f":"JAWABAN_PG!AM117","v":""},{"$f":"JAWABAN_PG!AN117","v":""},{"$f":"JAWABAN_PG!AO117","v":""},{"$f":"JAWABAN_PG!AP117","v":""},{"$f":"JAWABAN_PG!AQ117","v":""},{"$f":"JAWABAN_PG!AR117","v":""},{"$f":"JAWABAN_PG!AS117","v":""},{"$f":"JAWABAN_PG!AT117","v":""},{"$f":"JAWABAN_PG!AU117","v":""},{"$f":"JAWABAN_PG!AV117","v":""},{"$f":"JAWABAN_PG!AW117","v":""},{"$f":"JAWABAN_PG!AX117","v":""},{"$f":"JAWABAN_PG!AY117","v":""},{"$f":"JAWABAN_PG!AZ117","v":""},{"$f":"JAWABAN_PG!BA117","v":""},80,{"$f":"IF(BB28>=DATA!$G$15,\"TUNTAS\",\"BELUM TUNTAS\")","v":"TUNTAS"}]
[22,{"$f":"IF(VALUE(DATA!B27)=0, \"\", TEXT(VALUE(DATA!B27), REPT(\"0\", LEN(DATA!B27))))","v":"0096736537"},{"$f":"IF(DATA!C27=\"\",\"\",DATA!C27)","v":"RAYHAN NUR RAMDANI"},{"$f":"JAWABAN_PG!D118","v":0},{"$f":"JAWABAN_PG!E118","v":5},{"$f":"JAWABAN_PG!F118","v":5},{"$f":"JAWABAN_PG!G118","v":0},{"$f":"JAWABAN_PG!H118","v":5},{"$f":"JAWABAN_PG!I118","v":5},{"$f":"JAWABAN_PG!J118","v":5},{"$f":"JAWABAN_PG!K118","v":0},{"$f":"JAWABAN_PG!L118","v":0},{"$f":"JAWABAN_PG!M118","v":5},{"$f":"JAWABAN_PG!N118","v":5},{"$f":"JAWABAN_PG!O118","v":0},{"$f":"JAWABAN_PG!P118","v":5},{"$f":"JAWABAN_PG!Q118","v":5},{"$f":"JAWABAN_PG!R118","v":0},{"$f":"JAWABAN_PG!S118","v":0},{"$f":"JAWABAN_PG!T118","v":0},{"$f":"JAWABAN_PG!U118","v":5},{"$f":"JAWABAN_PG!V118","v":5},{"$f":"JAWABAN_PG!W118","v":5},{"$f":"JAWABAN_PG!X118","v":""},{"$f":"JAWABAN_PG!Y118","v":""},{"$f":"JAWABAN_PG!Z118","v":""},{"$f":"JAWABAN_PG!AA118","v":""},{"$f":"JAWABAN_PG!AB118","v":""},{"$f":"JAWABAN_PG!AC118","v":""},{"$f":"JAWABAN_PG!AD118","v":""},{"$f":"JAWABAN_PG!AE118","v":""},{"$f":"JAWABAN_PG!AF118","v":""},{"$f":"JAWABAN_PG!AG118","v":""},{"$f":"JAWABAN_PG!AH118","v":""},{"$f":"JAWABAN_PG!AI118","v":""},{"$f":"JAWABAN_PG!AJ118","v":""},{"$f":"JAWABAN_PG!AK118","v":""},{"$f":"JAWABAN_PG!AL118","v":""},{"$f":"JAWABAN_PG!AM118","v":""},{"$f":"JAWABAN_PG!AN118","v":""},{"$f":"JAWABAN_PG!AO118","v":""},{"$f":"JAWABAN_PG!AP118","v":""},{"$f":"JAWABAN_PG!AQ118","v":""},{"$f":"JAWABAN_PG!AR118","v":""},{"$f":"JAWABAN_PG!AS118","v":""},{"$f":"JAWABAN_PG!AT118","v":""},{"$f":"JAWABAN_PG!AU118","v":""},{"$f":"JAWABAN_PG!AV118","v":""},{"$f":"JAWABAN_PG!AW118","v":""},{"$f":"JAWABAN_PG!AX118","v":""},{"$f":"JAWABAN_PG!AY118","v":""},{"$f":"JAWABAN_PG!AZ118","v":""},{"$f":"JAWABAN_PG!BA118","v":""},60,{"$f":"IF(BB29>=DATA!$G$15,\"TUNTAS\",\"BELUM TUNTAS\")","v":"BELUM TUNTAS"}]
[23,{"$f":"IF(VALUE(DATA!B28)=0, \"\", TEXT(VALUE(DATA!B28), REPT(\"0\", LEN(DATA!B28))))","v":"0093056273"},{"$f":"IF(DATA!C28=\"\",\"\",DATA!C28)","v":"VINI NUR AVIANI"},{"$f":"JAWABAN_PG!D119","v":0},{"$f":"JAWABAN_PG!E119","v":0},{"$f":"JAWABAN_PG!F119","v":0},{"$f":"JAWABAN_PG!G119","v":0},{"$f":"JAWABAN_PG!H119","v":5},{"$f":"JAWABAN_PG!I119","v":5},{"$f":"JAWABAN_PG!J119","v":5},{"$f":"JAWABAN_PG!K119","v":0},{"$f":"JAWABAN_PG!L119","v":0},{"$f":"JAWABAN_PG!M119","v":0},{"$f":"JAWABAN_PG!N119","v":5},{"$f":"JAWABAN_PG!O119","v":0},{"$f":"JAWABAN_PG!P119","v":5},{"$f":"JAWABAN_PG!Q119","v":5},{"$f":"JAWABAN_PG!R119","v":0},{"$f":"JAWABAN_PG!S119","v":5},{"$f":"JAWABAN_PG!T119","v":5},{"$f":"JAWABAN_PG!U119","v":5},{"$f":"JAWABAN_PG!V119","v":5},{"$f":"JAWABAN_PG!W119","v":5},{"$f":"JAWABAN_PG!X119","v":""},{"$f":"JAWABAN_PG!Y119","v":""},{"$f":"JAWABAN_PG!Z119","v":""},{"$f":"JAWABAN_PG!AA119","v":""},{"$f":"JAWABAN_PG!AB119","v":""},{"$f":"JAWABAN_PG!AC119","v":""},{"$f":"JAWABAN_PG!AD119","v":""},{"$f":"JAWABAN_PG!AE119","v":""},{"$f":"JAWABAN_PG!AF119","v":""},{"$f":"JAWABAN_PG!AG119","v":""},{"$f":"JAWABAN_PG!AH119","v":""},{"$f":"JAWABAN_PG!AI119","v":""},{"$f":"JAWABAN_PG!AJ119","v":""},{"$f":"JAWABAN_PG!AK119","v":""},{"$f":"JAWABAN_PG!AL119","v":""},{"$f":"JAWABAN_PG!AM119","v":""},{"$f":"JAWABAN_PG!AN119","v":""},{"$f":"JAWABAN_PG!AO119","v":""},{"$f":"JAWABAN_PG!AP119","v":""},{"$f":"JAWABAN_PG!AQ119","v":""},{"$f":"JAWABAN_PG!AR119","v":""},{"$f":"JAWABAN_PG!AS119","v":""},{"$f":"JAWABAN_PG!AT119","v":""},{"$f":"JAWABAN_PG!AU119","v":""},{"$f":"JAWABAN_PG!AV119","v":""},{"$f":"JAWABAN_PG!AW119","v":""},{"$f":"JAWABAN_PG!AX119","v":""},{"$f":"JAWABAN_PG!AY119","v":""},{"$f":"JAWABAN_PG!AZ119","v":""},{"$f":"JAWABAN_PG!BA119","v":""},55,{"$f":"IF(BB30>=DATA!$G$15,\"TUNTAS\",\"BELUM TUNTAS\")","v":"BELUM TUNTAS"}]
[24,{"$f":"IF(VALUE(DATA!B29)=0, \"\", TEXT(VALUE(DATA!B29), REPT(\"0\", LEN(DATA!B29))))","v":"0099416925"},{"$f":"IF(DATA!C29=\"\",\"\",DATA!C29)","v":"YULIA SITI QOYIMAH"},{"$f":"JAWABAN_PG!D120","v":0},{"$f":"JAWABAN_PG!E120","v":0},{"$f":"JAWABAN_PG!F120","v":5},{"$f":"JAWABAN_PG!G120","v":0},{"$f":"JAWABAN_PG!H120","v":0},{"$f":"JAWABAN_PG!I120","v":0},{"$f":"JAWABAN_PG!J120","v":0},{"$f":"JAWABAN_PG!K120","v":0},{"$f":"JAWABAN_PG!L120","v":0},{"$f":"JAWABAN_PG!M120","v":0},{"$f":"JAWABAN_PG!N120","v":0},{"$f":"JAWABAN_PG!O120","v":0},{"$f":"JAWABAN_PG!P120","v":0},{"$f":"JAWABAN_PG!Q120","v":0},{"$f":"JAWABAN_PG!R120","v":0},{"$f":"JAWABAN_PG!S120","v":0},{"$f":"JAWABAN_PG!T120","v":0},{"$f":"JAWABAN_PG!U120","v":0},{"$f":"JAWABAN_PG!V120","v":0},{"$f":"JAWABAN_PG!W120","v":0},{"$f":"JAWABAN_PG!X120","v":""},{"$f":"JAWABAN_PG!Y120","v":""},{"$f":"JAWABAN_PG!Z120","v":""},{"$f":"JAWABAN_PG!AA120","v":""},{"$f":"JAWABAN_PG!AB120","v":""},{"$f":"JAWABAN_PG!AC120","v":""},{"$f":"JAWABAN_PG!AD120","v":""},{"$f":"JAWABAN_PG!AE120","v":""},{"$f":"JAWABAN_PG!AF120","v":""},{"$f":"JAWABAN_PG!AG120","v":""},{"$f":"JAWABAN_PG!AH120","v":""},{"$f":"JAWABAN_PG!AI120","v":""},{"$f":"JAWABAN_PG!AJ120","v":""},{"$f":"JAWABAN_PG!AK120","v":""},{"$f":"JAWABAN_PG!AL120","v":""},{"$f":"JAWABAN_PG!AM120","v":""},{"$f":"JAWABAN_PG!AN120","v":""},{"$f":"JAWABAN_PG!AO120","v":""},{"$f":"JAWABAN_PG!AP120","v":""},{"$f":"JAWABAN_PG!AQ120","v":""},{"$f":"JAWABAN_PG!AR120","v":""},{"$f":"JAWABAN_PG!AS120","v":""},{"$f":"JAWABAN_PG!AT120","v":""},{"$f":"JAWABAN_PG!AU120","v":""},{"$f":"JAWABAN_PG!AV120","v":""},{"$f":"JAWABAN_PG!AW120","v":""},{"$f":"JAWABAN_PG!AX120","v":""},{"$f":"JAWABAN_PG!AY120","v":""},{"$f":"JAWABAN_PG!AZ120","v":""},{"$f":"JAWABAN_PG!BA120","v":""},5,{"$f":"IF(BB31>=DATA!$G$15,\"TUNTAS\",\"BELUM TUNTAS\")","v":"BELUM TUNTAS"}]
[25,{"$f":"IF(VALUE(DATA!B30)=0, \"\", TEXT(VALUE(DATA!B30), REPT(\"0\", LEN(DATA!B30))))","v":""},{"$f":"IF(DATA!C30=\"\",\"\",DATA!C30)","v":""},{"$f":"JAWABAN_PG!D121","v":""},{"$f":"JAWABAN_PG!E121","v":""},{"$f":"JAWABAN_PG!F121","v":""},{"$f":"JAWABAN_PG!G121","v":""},{"$f":"JAWABAN_PG!H121","v":""},{"$f":"JAWABAN_PG!I121","v":""},{"$f":"JAWABAN_PG!J121","v":""},{"$f":"JAWABAN_PG!K121","v":""},{"$f":"JAWABAN_PG!L121","v":""},{"$f":"JAWABAN_PG!M121","v":""},{"$f":"JAWABAN_PG!N121","v":""},{"$f":"JAWABAN_PG!O121","v":""},{"$f":"JAWABAN_PG!P121","v":""},{"$f":"JAWABAN_PG!Q121","v":""},{"$f":"JAWABAN_PG!R121","v":""},{"$f":"JAWABAN_PG!S121","v":""},{"$f":"JAWABAN_PG!T121","v":""},{"$f":"JAWABAN_PG!U121","v":""},{"$f":"JAWABAN_PG!V121","v":""},{"$f":"JAWABAN_PG!W121","v":""},{"$f":"JAWABAN_PG!X121","v":""},{"$f":"JAWABAN_PG!Y121","v":""},{"$f":"JAWABAN_PG!Z121","v":""},{"$f":"JAWABAN_PG!AA121","v":""},{"$f":"JAWABAN_PG!AB121","v":""},{"$f":"JAWABAN_PG!AC121","v":""},{"$f":"JAWABAN_PG!AD121","v":""},{"$f":"JAWABAN_PG!AE121","v":""},{"$f":"JAWABAN_PG!AF121","v":""},{"$f":"JAWABAN_PG!AG121","v":""},{"$f":"JAWABAN_PG!AH121","v":""},{"$f":"JAWABAN_PG!AI121","v":""},{"$f":"JAWABAN_PG!AJ121","v":""},{"$f":"JAWABAN_PG!AK121","v":""},{"$f":"JAWABAN_PG!AL121","v":""},{"$f":"JAWABAN_PG!AM121","v":""},{"$f":"JAWABAN_PG!AN121","v":""},{"$f":"JAWABAN_PG!AO121","v":""},{"$f":"JAWABAN_PG!AP121","v":""},{"$f":"JAWABAN_PG!AQ121","v":""},{"$f":"JAWABAN_PG!AR121","v":""},{"$f":"JAWABAN_PG!AS121","v":""},{"$f":"JAWABAN_PG!AT121","v":""},{"$f":"JAWABAN_PG!AU121","v":""},{"$f":"JAWABAN_PG!AV121","v":""},{"$f":"JAWABAN_PG!AW121","v":""},{"$f":"JAWABAN_PG!AX121","v":""},{"$f":"JAWABAN_PG!AY121","v":""},{"$f":"JAWABAN_PG!AZ121","v":""},{"$f":"JAWABAN_PG!BA121","v":""},0,{"$f":"IF(BB32>=DATA!$G$15,\"TUNTAS\",\"BELUM TUNTAS\")","v":"BELUM TUNTAS"}]
[26,{"$f":"IF(VALUE(DATA!B31)=0, \"\", TEXT(VALUE(DATA!B31), REPT(\"0\", LEN(DATA!B31))))","v":""},{"$f":"IF(DATA!C31=\"\",\"\",DATA!C31)","v":""},{"$f":"JAWABAN_PG!D122","v":""},{"$f":"JAWABAN_PG!E122","v":""},{"$f":"JAWABAN_PG!F122","v":""},{"$f":"JAWABAN_PG!G122","v":""},{"$f":"JAWABAN_PG!H122","v":""},{"$f":"JAWABAN_PG!I122","v":""},{"$f":"JAWABAN_PG!J122","v":""},{"$f":"JAWABAN_PG!K122","v":""},{"$f":"JAWABAN_PG!L122","v":""},{"$f":"JAWABAN_PG!M122","v":""},{"$f":"JAWABAN_PG!N122","v":""},{"$f":"JAWABAN_PG!O122","v":""},{"$f":"JAWABAN_PG!P122","v":""},{"$f":"JAWABAN_PG!Q122","v":""},{"$f":"JAWABAN_PG!R122","v":""},{"$f":"JAWABAN_PG!S122","v":""},{"$f":"JAWABAN_PG!T122","v":""},{"$f":"JAWABAN_PG!U122","v":""},{"$f":"JAWABAN_PG!V122","v":""},{"$f":"JAWABAN_PG!W122","v":""},{"$f":"JAWABAN_PG!X122","v":""},{"$f":"JAWABAN_PG!Y122","v":""},{"$f":"JAWABAN_PG!Z122","v":""},{"$f":"JAWABAN_PG!AA122","v":""},{"$f":"JAWABAN_PG!AB122","v":""},{"$f":"JAWABAN_PG!AC122","v":""},{"$f":"JAWABAN_PG!AD122","v":""},{"$f":"JAWABAN_PG!AE122","v":""},{"$f":"JAWABAN_PG!AF122","v":""},{"$f":"JAWABAN_PG!AG122","v":""},{"$f":"JAWABAN_PG!AH122","v":""},{"$f":"JAWABAN_PG!AI122","v":""},{"$f":"JAWABAN_PG!AJ122","v":""},{"$f":"JAWABAN_PG!AK122","v":""},{"$f":"JAWABAN_PG!AL122","v":""},{"$f":"JAWABAN_PG!AM122","v":""},{"$f":"JAWABAN_PG!AN122","v":""},{"$f":"JAWABAN_PG!AO122","v":""},{"$f":"JAWABAN_PG!AP122","v":""},{"$f":"JAWABAN_PG!AQ122","v":""},{"$f":"JAWABAN_PG!AR122","v":""},{"$f":"JAWABAN_PG!AS122","v":""},{"$f":"JAWABAN_PG!AT122","v":""},{"$f":"JAWABAN_PG!AU122","v":""},{"$f":"JAWABAN_PG!AV122","v":""},{"$f":"JAWABAN_PG!AW122","v":""},{"$f":"JAWABAN_PG!AX122","v":""},{"$f":"JAWABAN_PG!AY122","v":""},{"$f":"JAWABAN_PG!AZ122","v":""},{"$f":"JAWABAN_PG!BA122","v":""},0,{"$f":"IF(BB33>=DATA!$G$15,\"TUNTAS\",\"BELUM TUNTAS\")","v":"BELUM TUNTAS"}]
[27,{"$f":"IF(VALUE(DATA!B32)=0, \"\", TEXT(VALUE(DATA!B32), REPT(\"0\", LEN(DATA!B32))))","v":""},{"$f":"IF(DATA!C32=\"\",\"\",DATA!C32)","v":""},{"$f":"JAWABAN_PG!D123","v":""},{"$f":"JAWABAN_PG!E123","v":""},{"$f":"JAWABAN_PG!F123","v":""},{"$f":"JAWABAN_PG!G123","v":""},{"$f":"JAWABAN_PG!H123","v":""},{"$f":"JAWABAN_PG!I123","v":""},{"$f":"JAWABAN_PG!J123","v":""},{"$f":"JAWABAN_PG!K123","v":""},{"$f":"JAWABAN_PG!L123","v":""},{"$f":"JAWABAN_PG!M123","v":""},{"$f":"JAWABAN_PG!N123","v":""},{"$f":"JAWABAN_PG!O123","v":""},{"$f":"JAWABAN_PG!P123","v":""},{"$f":"JAWABAN_PG!Q123","v":""},{"$f":"JAWABAN_PG!R123","v":""},{"$f":"JAWABAN_PG!S123","v":""},{"$f":"JAWABAN_PG!T123","v":""},{"$f":"JAWABAN_PG!U123","v":""},{"$f":"JAWABAN_PG!V123","v":""},{"$f":"JAWABAN_PG!W123","v":""},{"$f":"JAWABAN_PG!X123","v":""},{"$f":"JAWABAN_PG!Y123","v":""},{"$f":"JAWABAN_PG!Z123","v":""},{"$f":"JAWABAN_PG!AA123","v":""},{"$f":"JAWABAN_PG!AB123","v":""},{"$f":"JAWABAN_PG!AC123","v":""},{"$f":"JAWABAN_PG!AD123","v":""},{"$f":"JAWABAN_PG!AE123","v":""},{"$f":"JAWABAN_PG!AF123","v":""},{"$f":"JAWABAN_PG!AG123","v":""},{"$f":"JAWABAN_PG!AH123","v":""},{"$f":"JAWABAN_PG!AI123","v":""},{"$f":"JAWABAN_PG!AJ123","v":""},{"$f":"JAWABAN_PG!AK123","v":""},{"$f":"JAWABAN_PG!AL123","v":""},{"$f":"JAWABAN_PG!AM123","v":""},{"$f":"JAWABAN_PG!AN123","v":""},{"$f":"JAWABAN_PG!AO123","v":""},{"$f":"JAWABAN_PG!AP123","v":""},{"$f":"JAWABAN_PG!AQ123","v":""},{"$f":"JAWABAN_PG!AR123","v":""},{"$f":"JAWABAN_PG!AS123","v":""},{"$f":"JAWABAN_PG!AT123","v":""},{"$f":"JAWABAN_PG!AU123","v":""},{"$f":"JAWABAN_PG!AV123","v":""},{"$f":"JAWABAN_PG!AW123","v":""},{"$f":"JAWABAN_PG!AX123","v":""},{"$f":"JAWABAN_PG!AY123","v":""},{"$f":"JAWABAN_PG!AZ123","v":""},{"$f":"JAWABAN_PG!BA123","v":""},0,{"$f":"IF(BB34>=DATA!$G$15,\"TUNTAS\",\"BELUM TUNTAS\")","v":"BELUM TUNTAS"}]
[28,{"$f":"IF(VALUE(DATA!B33)=0, \"\", TEXT(VALUE(DATA!B33), REPT(\"0\", LEN(DATA!B33))))","v":""},{"$f":"IF(DATA!C33=\"\",\"\",DATA!C33)","v":""},{"$f":"JAWABAN_PG!D124","v":""},{"$f":"JAWABAN_PG!E124","v":""},{"$f":"JAWABAN_PG!F124","v":""},{"$f":"JAWABAN_PG!G124","v":""},{"$f":"JAWABAN_PG!H124","v":""},{"$f":"JAWABAN_PG!I124","v":""},{"$f":"JAWABAN_PG!J124","v":""},{"$f":"JAWABAN_PG!K124","v":""},{"$f":"JAWABAN_PG!L124","v":""},{"$f":"JAWABAN_PG!M124","v":""},{"$f":"JAWABAN_PG!N124","v":""},{"$f":"JAWABAN_PG!O124","v":""},{"$f":"JAWABAN_PG!P124","v":""},{"$f":"JAWABAN_PG!Q124","v":""},{"$f":"JAWABAN_PG!R124","v":""},{"$f":"JAWABAN_PG!S124","v":""},{"$f":"JAWABAN_PG!T124","v":""},{"$f":"JAWABAN_PG!U124","v":""},{"$f":"JAWABAN_PG!V124","v":""},{"$f":"JAWABAN_PG!W124","v":""},{"$f":"JAWABAN_PG!X124","v":""},{"$f":"JAWABAN_PG!Y124","v":""},{"$f":"JAWABAN_PG!Z124","v":""},{"$f":"JAWABAN_PG!AA124","v":""},{"$f":"JAWABAN_PG!AB124","v":""},{"$f":"JAWABAN_PG!AC124","v":""},{"$f":"JAWABAN_PG!AD124","v":""},{"$f":"JAWABAN_PG!AE124","v":""},{"$f":"JAWABAN_PG!AF124","v":""},{"$f":"JAWABAN_PG!AG124","v":""},{"$f":"JAWABAN_PG!AH124","v":""},{"$f":"JAWABAN_PG!AI124","v":""},{"$f":"JAWABAN_PG!AJ124","v":""},{"$f":"JAWABAN_PG!AK124","v":""},{"$f":"JAWABAN_PG!AL124","v":""},{"$f":"JAWABAN_PG!AM124","v":""},{"$f":"JAWABAN_PG!AN124","v":""},{"$f":"JAWABAN_PG!AO124","v":""},{"$f":"JAWABAN_PG!AP124","v":""},{"$f":"JAWABAN_PG!AQ124","v":""},{"$f":"JAWABAN_PG!AR124","v":""},{"$f":"JAWABAN_PG!AS124","v":""},{"$f":"JAWABAN_PG!AT124","v":""},{"$f":"JAWABAN_PG!AU124","v":""},{"$f":"JAWABAN_PG!AV124","v":""},{"$f":"JAWABAN_PG!AW124","v":""},{"$f":"JAWABAN_PG!AX124","v":""},{"$f":"JAWABAN_PG!AY124","v":""},{"$f":"JAWABAN_PG!AZ124","v":""},{"$f":"JAWABAN_PG!BA124","v":""},0,{"$f":"IF(BB35>=DATA!$G$15,\"TUNTAS\",\"BELUM TUNTAS\")","v":"BELUM TUNTAS"}]
[29,{"$f":"IF(VALUE(DATA!B34)=0, \"\", TEXT(VALUE(DATA!B34), REPT(\"0\", LEN(DATA!B34))))","v":""},{"$f":"IF(DATA!C34=\"\",\"\",DATA!C34)","v":""},{"$f":"JAWABAN_PG!D125","v":""},{"$f":"JAWABAN_PG!E125","v":""},{"$f":"JAWABAN_PG!F125","v":""},{"$f":"JAWABAN_PG!G125","v":""},{"$f":"JAWABAN_PG!H125","v":""},{"$f":"JAWABAN_PG!I125","v":""},{"$f":"JAWABAN_PG!J125","v":""},{"$f":"JAWABAN_PG!K125","v":""},{"$f":"JAWABAN_PG!L125","v":""},{"$f":"JAWABAN_PG!M125","v":""},{"$f":"JAWABAN_PG!N125","v":""},{"$f":"JAWABAN_PG!O125","v":""},{"$f":"JAWABAN_PG!P125","v":""},{"$f":"JAWABAN_PG!Q125","v":""},{"$f":"JAWABAN_PG!R125","v":""},{"$f":"JAWABAN_PG!S125","v":""},{"$f":"JAWABAN_PG!T125","v":""},{"$f":"JAWABAN_PG!U125","v":""},{"$f":"JAWABAN_PG!V125","v":""},{"$f":"JAWABAN_PG!W125","v":""},{"$f":"JAWABAN_PG!X125","v":""},{"$f":"JAWABAN_PG!Y125","v":""},{"$f":"JAWABAN_PG!Z125","v":""},{"$f":"JAWABAN_PG!AA125","v":""},{"$f":"JAWABAN_PG!AB125","v":""},{"$f":"JAWABAN_PG!AC125","v":""},{"$f":"JAWABAN_PG!AD125","v":""},{"$f":"JAWABAN_PG!AE125","v":""},{"$f":"JAWABAN_PG!AF125","v":""},{"$f":"JAWABAN_PG!AG125","v":""},{"$f":"JAWABAN_PG!AH125","v":""},{"$f":"JAWABAN_PG!AI125","v":""},{"$f":"JAWABAN_PG!AJ125","v":""},{"$f":"JAWABAN_PG!AK125","v":""},{"$f":"JAWABAN_PG!AL125","v":""},{"$f":"JAWABAN_PG!AM125","v":""},{"$f":"JAWABAN_PG!AN125","v":""},{"$f":"JAWABAN_PG!AO125","v":""},{"$f":"JAWABAN_PG!AP125","v":""},{"$f":"JAWABAN_PG!AQ125","v":""},{"$f":"JAWABAN_PG!AR125","v":""},{"$f":"JAWABAN_PG!AS125","v":""},{"$f":"JAWABAN_PG!AT125","v":""},{"$f":"JAWABAN_PG!AU125","v":""},{"$f":"JAWABAN_PG!AV125","v":""},{"$f":"JAWABAN_PG!AW125","v":""},{"$f":"JAWABAN_PG!AX125","v":""},{"$f":"JAWABAN_PG!AY125","v":""},{"$f":"JAWABAN_PG!AZ125","v":""},{"$f":"JAWABAN_PG!BA125","v":""},0,{"$f":"IF(BB36>=DATA!$G$15,\"TUNTAS\",\"BELUM TUNTAS\")","v":"BELUM TUNTAS"}]
[30,{"$f":"IF(VALUE(DATA!B35)=0, \"\", TEXT(VALUE(DATA!B35), REPT(\"0\", LEN(DATA!B35))))","v":""},{"$f":"IF(DATA!C35=\"\",\"\",DATA!C35)","v":""},{"$f":"JAWABAN_PG!D126","v":""},{"$f":"JAWABAN_PG!E126","v":""},{"$f":"JAWABAN_PG!F126","v":""},{"$f":"JAWABAN_PG!G126","v":""},{"$f":"JAWABAN_PG!H126","v":""},{"$f":"JAWABAN_PG!I126","v":""},{"$f":"JAWABAN_PG!J126","v":""},{"$f":"JAWABAN_PG!K126","v":""},{"$f":"JAWABAN_PG!L126","v":""},{"$f":"JAWABAN_PG!M126","v":""},{"$f":"JAWABAN_PG!N126","v":""},{"$f":"JAWABAN_PG!O126","v":""},{"$f":"JAWABAN_PG!P126","v":""},{"$f":"JAWABAN_PG!Q126","v":""},{"$f":"JAWABAN_PG!R126","v":""},{"$f":"JAWABAN_PG!S126","v":""},{"$f":"JAWABAN_PG!T126","v":""},{"$f":"JAWABAN_PG!U126","v":""},{"$f":"JAWABAN_PG!V126","v":""},{"$f":"JAWABAN_PG!W126","v":""},{"$f":"JAWABAN_PG!X126","v":""},{"$f":"JAWABAN_PG!Y126","v":""},{"$f":"JAWABAN_PG!Z126","v":""},{"$f":"JAWABAN_PG!AA126","v":""},{"$f":"JAWABAN_PG!AB126","v":""},{"$f":"JAWABAN_PG!AC126","v":""},{"$f":"JAWABAN_PG!AD126","v":""},{"$f":"JAWABAN_PG!AE126","v":""},{"$f":"JAWABAN_PG!AF126","v":""},{"$f":"JAWABAN_PG!AG126","v":""},{"$f":"JAWABAN_PG!AH126","v":""},{"$f":"JAWABAN_PG!AI126","v":""},{"$f":"JAWABAN_PG!AJ126","v":""},{"$f":"JAWABAN_PG!AK126","v":""},{"$f":"JAWABAN_PG!AL126","v":""},{"$f":"JAWABAN_PG!AM126","v":""},{"$f":"JAWABAN_PG!AN126","v":""},{"$f":"JAWABAN_PG!AO126","v":""},{"$f":"JAWABAN_PG!AP126","v":""},{"$f":"JAWABAN_PG!AQ126","v":""},{"$f":"JAWABAN_PG!AR126","v":""},{"$f":"JAWABAN_PG!AS126","v":""},{"$f":"JAWABAN_PG!AT126","v":""},{"$f":"JAWABAN_PG!AU126","v":""},{"$f":"JAWABAN_PG!AV126","v":""},{"$f":"JAWABAN_PG!AW126","v":""},{"$f":"JAWABAN_PG!AX126","v":""},{"$f":"JAWABAN_PG!AY126","v":""},{"$f":"JAWABAN_PG!AZ126","v":""},{"$f":"JAWABAN_PG!BA126","v":""},0,{"$f":"IF(BB37>=DATA!$G$15,\"TUNTAS\",\"BELUM TUNTAS\")","v":"BELUM TUNTAS"}]
[31,{"$f":"IF(VALUE(DATA!B36)=0, \"\", TEXT(VALUE(DATA!B36), REPT(\"0\", LEN(DATA!B36))))","v":""},{"$f":"IF(DATA!C36=\"\",\"\",DATA!C36)","v":""},{"$f":"JAWABAN_PG!D127","v":""},{"$f":"JAWABAN_PG!E127","v":""},{"$f":"JAWABAN_PG!F127","v":""},{"$f":"JAWABAN_PG!G127","v":""},{"$f":"JAWABAN_PG!H127","v":""},{"$f":"JAWABAN_PG!I127","v":""},{"$f":"JAWABAN_PG!J127","v":""},{"$f":"JAWABAN_PG!K127","v":""},{"$f":"JAWABAN_PG!L127","v":""},{"$f":"JAWABAN_PG!M127","v":""},{"$f":"JAWABAN_PG!N127","v":""},{"$f":"JAWABAN_PG!O127","v":""},{"$f":"JAWABAN_PG!P127","v":""},{"$f":"JAWABAN_PG!Q127","v":""},{"$f":"JAWABAN_PG!R127","v":""},{"$f":"JAWABAN_PG!S127","v":""},{"$f":"JAWABAN_PG!T127","v":""},{"$f":"JAWABAN_PG!U127","v":""},{"$f":"JAWABAN_PG!V127","v":""},{"$f":"JAWABAN_PG!W127","v":""},{"$f":"JAWABAN_PG!X127","v":""},{"$f":"JAWABAN_PG!Y127","v":""},{"$f":"JAWABAN_PG!Z127","v":""},{"$f":"JAWABAN_PG!AA127","v":""},{"$f":"JAWABAN_PG!AB127","v":""},{"$f":"JAWABAN_PG!AC127","v":""},{"$f":"JAWABAN_PG!AD127","v":""},{"$f":"JAWABAN_PG!AE127","v":""},{"$f":"JAWABAN_PG!AF127","v":""},{"$f":"JAWABAN_PG!AG127","v":""},{"$f":"JAWABAN_PG!AH127","v":""},{"$f":"JAWABAN_PG!AI127","v":""},{"$f":"JAWABAN_PG!AJ127","v":""},{"$f":"JAWABAN_PG!AK127","v":""},{"$f":"JAWABAN_PG!AL127","v":""},{"$f":"JAWABAN_PG!AM127","v":""},{"$f":"JAWABAN_PG!AN127","v":""},{"$f":"JAWABAN_PG!AO127","v":""},{"$f":"JAWABAN_PG!AP127","v":""},{"$f":"JAWABAN_PG!AQ127","v":""},{"$f":"JAWABAN_PG!AR127","v":""},{"$f":"JAWABAN_PG!AS127","v":""},{"$f":"JAWABAN_PG!AT127","v":""},{"$f":"JAWABAN_PG!AU127","v":""},{"$f":"JAWABAN_PG!AV127","v":""},{"$f":"JAWABAN_PG!AW127","v":""},{"$f":"JAWABAN_PG!AX127","v":""},{"$f":"JAWABAN_PG!AY127","v":""},{"$f":"JAWABAN_PG!AZ127","v":""},{"$f":"JAWABAN_PG!BA127","v":""},0,{"$f":"IF(BB38>=DATA!$G$15,\"TUNTAS\",\"BELUM TUNTAS\")","v":"BELUM TUNTAS"}]
[32,{"$f":"IF(VALUE(DATA!B37)=0, \"\", TEXT(VALUE(DATA!B37), REPT(\"0\", LEN(DATA!B37))))","v":""},{"$f":"IF(DATA!C37=\"\",\"\",DATA!C37)","v":""},{"$f":"JAWABAN_PG!D128","v":""},{"$f":"JAWABAN_PG!E128","v":""},{"$f":"JAWABAN_PG!F128","v":""},{"$f":"JAWABAN_PG!G128","v":""},{"$f":"JAWABAN_PG!H128","v":""},{"$f":"JAWABAN_PG!I128","v":""},{"$f":"JAWABAN_PG!J128","v":""},{"$f":"JAWABAN_PG!K128","v":""},{"$f":"JAWABAN_PG!L128","v":""},{"$f":"JAWABAN_PG!M128","v":""},{"$f":"JAWABAN_PG!N128","v":""},{"$f":"JAWABAN_PG!O128","v":""},{"$f":"JAWABAN_PG!P128","v":""},{"$f":"JAWABAN_PG!Q128","v":""},{"$f":"JAWABAN_PG!R128","v":""},{"$f":"JAWABAN_PG!S128","v":""},{"$f":"JAWABAN_PG!T128","v":""},{"$f":"JAWABAN_PG!U128","v":""},{"$f":"JAWABAN_PG!V128","v":""},{"$f":"JAWABAN_PG!W128","v":""},{"$f":"JAWABAN_PG!X128","v":""},{"$f":"JAWABAN_PG!Y128","v":""},{"$f":"JAWABAN_PG!Z128","v":""},{"$f":"JAWABAN_PG!AA128","v":""},{"$f":"JAWABAN_PG!AB128","v":""},{"$f":"JAWABAN_PG!AC128","v":""},{"$f":"JAWABAN_PG!AD128","v":""},{"$f":"JAWABAN_PG!AE128","v":""},{"$f":"JAWABAN_PG!AF128","v":""},{"$f":"JAWABAN_PG!AG128","v":""},{"$f":"JAWABAN_PG!AH128","v":""},{"$f":"JAWABAN_PG!AI128","v":""},{"$f":"JAWABAN_PG!AJ128","v":""},{"$f":"JAWABAN_PG!AK128","v":""},{"$f":"JAWABAN_PG!AL128","v":""},{"$f":"JAWABAN_PG!AM128","v":""},{"$f":"JAWABAN_PG!AN128","v":""},{"$f":"JAWABAN_PG!AO128","v":""},{"$f":"JAWABAN_PG!AP128","v":""},{"$f":"JAWABAN_PG!AQ128","v":""},{"$f":"JAWABAN_PG!AR128","v":""},{"$f":"JAWABAN_PG!AS128","v":""},{"$f":"JAWABAN_PG!AT128","v":""},{"$f":"JAWABAN_PG!AU128","v":""},{"$f":"JAWABAN_PG!AV128","v":""},{"$f":"JAWABAN_PG!AW128","v":""},{"$f":"JAWABAN_PG!AX128","v":""},{"$f":"JAWABAN_PG!AY128","v":""},{"$f":"JAWABAN_PG!AZ128","v":""},{"$f":"JAWABAN_PG!BA128","v":""},0,{"$f":"IF(BB39>=DATA!$G$15,\"TUNTAS\",\"BELUM TUNTAS\")","v":"BELUM TUNTAS"}]
[33,{"$f":"IF(VALUE(DATA!B38)=0, \"\", TEXT(VALUE(DATA!B38), REPT(\"0\", LEN(DATA!B38))))","v":""},{"$f":"IF(DATA!C38=\"\",\"\",DATA!C38)","v":""},{"$f":"JAWABAN_PG!D129","v":""},{"$f":"JAWABAN_PG!E129","v":""},{"$f":"JAWABAN_PG!F129","v":""},{"$f":"JAWABAN_PG!G129","v":""},{"$f":"JAWABAN_PG!H129","v":""},{"$f":"JAWABAN_PG!I129","v":""},{"$f":"JAWABAN_PG!J129","v":""},{"$f":"JAWABAN_PG!K129","v":""},{"$f":"JAWABAN_PG!L129","v":""},{"$f":"JAWABAN_PG!M129","v":""},{"$f":"JAWABAN_PG!N129","v":""},{"$f":"JAWABAN_PG!O129","v":""},{"$f":"JAWABAN_PG!P129","v":""},{"$f":"JAWABAN_PG!Q129","v":""},{"$f":"JAWABAN_PG!R129","v":""},{"$f":"JAWABAN_PG!S129","v":""},{"$f":"JAWABAN_PG!T129","v":""},{"$f":"JAWABAN_PG!U129","v":""},{"$f":"JAWABAN_PG!V129","v":""},{"$f":"JAWABAN_PG!W129","v":""},{"$f":"JAWABAN_PG!X129","v":""},{"$f":"JAWABAN_PG!Y129","v":""},{"$f":"JAWABAN_PG!Z129","v":""},{"$f":"JAWABAN_PG!AA129","v":""},{"$f":"JAWABAN_PG!AB129","v":""},{"$f":"JAWABAN_PG!AC129","v":""},{"$f":"JAWABAN_PG!AD129","v":""},{"$f":"JAWABAN_PG!AE129","v":""},{"$f":"JAWABAN_PG!AF129","v":""},{"$f":"JAWABAN_PG!AG129","v":""},{"$f":"JAWABAN_PG!AH129","v":""},{"$f":"JAWABAN_PG!AI129","v":""},{"$f":"JAWABAN_PG!AJ129","v":""},{"$f":"JAWABAN_PG!AK129","v":""},{"$f":"JAWABAN_PG!AL129","v":""},{"$f":"JAWABAN_PG!AM129","v":""},{"$f":"JAWABAN_PG!AN129","v":""},{"$f":"JAWABAN_PG!AO129","v":""},{"$f":"JAWABAN_PG!AP129","v":""},{"$f":"JAWABAN_PG!AQ129","v":""},{"$f":"JAWABAN_PG!AR129","v":""},{"$f":"JAWABAN_PG!AS129","v":""},{"$f":"JAWABAN_PG!AT129","v":""},{"$f":"JAWABAN_PG!AU129","v":""},{"$f":"JAWABAN_PG!AV129","v":""},{"$f":"JAWABAN_PG!AW129","v":""},{"$f":"JAWABAN_PG!AX129","v":""},{"$f":"JAWABAN_PG!AY129","v":""},{"$f":"JAWABAN_PG!AZ129","v":""},{"$f":"JAWABAN_PG!BA129","v":""},0,{"$f":"IF(BB40>=DATA!$G$15,\"TUNTAS\",\"BELUM TUNTAS\")","v":"BELUM TUNTAS"}]
[34,{"$f":"IF(VALUE(DATA!B39)=0, \"\", TEXT(VALUE(DATA!B39), REPT(\"0\", LEN(DATA!B39))))","v":""},{"$f":"IF(DATA!C39=\"\",\"\",DATA!C39)","v":""},{"$f":"JAWABAN_PG!D130","v":""},{"$f":"JAWABAN_PG!E130","v":""},{"$f":"JAWABAN_PG!F130","v":""},{"$f":"JAWABAN_PG!G130","v":""},{"$f":"JAWABAN_PG!H130","v":""},{"$f":"JAWABAN_PG!I130","v":""},{"$f":"JAWABAN_PG!J130","v":""},{"$f":"JAWABAN_PG!K130","v":""},{"$f":"JAWABAN_PG!L130","v":""},{"$f":"JAWABAN_PG!M130","v":""},{"$f":"JAWABAN_PG!N130","v":""},{"$f":"JAWABAN_PG!O130","v":""},{"$f":"JAWABAN_PG!P130","v":""},{"$f":"JAWABAN_PG!Q130","v":""},{"$f":"JAWABAN_PG!R130","v":""},{"$f":"JAWABAN_PG!S130","v":""},{"$f":"JAWABAN_PG!T130","v":""},{"$f":"JAWABAN_PG!U130","v":""},{"$f":"JAWABAN_PG!V130","v":""},{"$f":"JAWABAN_PG!W130","v":""},{"$f":"JAWABAN_PG!X130","v":""},{"$f":"JAWABAN_PG!Y130","v":""},{"$f":"JAWABAN_PG!Z130","v":""},{"$f":"JAWABAN_PG!AA130","v":""},{"$f":"JAWABAN_PG!AB130","v":""},{"$f":"JAWABAN_PG!AC130","v":""},{"$f":"JAWABAN_PG!AD130","v":""},{"$f":"JAWABAN_PG!AE130","v":""},{"$f":"JAWABAN_PG!AF130","v":""},{"$f":"JAWABAN_PG!AG130","v":""},{"$f":"JAWABAN_PG!AH130","v":""},{"$f":"JAWABAN_PG!AI130","v":""},{"$f":"JAWABAN_PG!AJ130","v":""},{"$f":"JAWABAN_PG!AK130","v":""},{"$f":"JAWABAN_PG!AL130","v":""},{"$f":"JAWABAN_PG!AM130","v":""},{"$f":"JAWABAN_PG!AN130","v":""},{"$f":"JAWABAN_PG!AO130","v":""},{"$f":"JAWABAN_PG!AP130","v":""},{"$f":"JAWABAN_PG!AQ130","v":""},{"$f":"JAWABAN_PG!AR130","v":""},{"$f":"JAWABAN_PG!AS130","v":""},{"$f":"JAWABAN_PG!AT130","v":""},{"$f":"JAWABAN_PG!AU130","v":""},{"$f":"JAWABAN_PG!AV130","v":""},{"$f":"JAWABAN_PG!AW130","v":""},{"$f":"JAWABAN_PG!AX130","v":""},{"$f":"JAWABAN_PG!AY130","v":""},{"$f":"JAWABAN_PG!AZ130","v":""},{"$f":"JAWABAN_PG!BA130","v":""},0,{"$f":"IF(BB41>=DATA!$G$15,\"TUNTAS\",\"BELUM TUNTAS\")","v":"BELUM TUNTAS"}]
[35,{"$f":"IF(VALUE(DATA!B40)=0, \"\", TEXT(VALUE(DATA!B40), REPT(\"0\", LEN(DATA!B40))))","v":""},{"$f":"IF(DATA!C40=\"\",\"\",DATA!C40)","v":""},{"$f":"JAWABAN_PG!D131","v":""},{"$f":"JAWABAN_PG!E131","v":""},{"$f":"JAWABAN_PG!F131","v":""},{"$f":"JAWABAN_PG!G131","v":""},{"$f":"JAWABAN_PG!H131","v":""},{"$f":"JAWABAN_PG!I131","v":""},{"$f":"JAWABAN_PG!J131","v":""},{"$f":"JAWABAN_PG!K131","v":""},{"$f":"JAWABAN_PG!L131","v":""},{"$f":"JAWABAN_PG!M131","v":""},{"$f":"JAWABAN_PG!N131","v":""},{"$f":"JAWABAN_PG!O131","v":""},{"$f":"JAWABAN_PG!P131","v":""},{"$f":"JAWABAN_PG!Q131","v":""},{"$f":"JAWABAN_PG!R131","v":""},{"$f":"JAWABAN_PG!S131","v":""},{"$f":"JAWABAN_PG!T131","v":""},{"$f":"JAWABAN_PG!U131","v":""},{"$f":"JAWABAN_PG!V131","v":""},{"$f":"JAWABAN_PG!W131","v":""},{"$f":"JAWABAN_PG!X131","v":""},{"$f":"JAWABAN_PG!Y131","v":""},{"$f":"JAWABAN_PG!Z131","v":""},{"$f":"JAWABAN_PG!AA131","v":""},{"$f":"JAWABAN_PG!AB131","v":""},{"$f":"JAWABAN_PG!AC131","v":""},{"$f":"JAWABAN_PG!AD131","v":""},{"$f":"JAWABAN_PG!AE131","v":""},{"$f":"JAWABAN_PG!AF131","v":""},{"$f":"JAWABAN_PG!AG131","v":""},{"$f":"JAWABAN_PG!AH131","v":""},{"$f":"JAWABAN_PG!AI131","v":""},{"$f":"JAWABAN_PG!AJ131","v":""},{"$f":"JAWABAN_PG!AK131","v":""},{"$f":"JAWABAN_PG!AL131","v":""},{"$f":"JAWABAN_PG!AM131","v":""},{"$f":"JAWABAN_PG!AN131","v":""},{"$f":"JAWABAN_PG!AO131","v":""},{"$f":"JAWABAN_PG!AP131","v":""},{"$f":"JAWABAN_PG!AQ131","v":""},{"$f":"JAWABAN_PG!AR131","v":""},{"$f":"JAWABAN_PG!AS131","v":""},{"$f":"JAWABAN_PG!AT131","v":""},{"$f":"JAWABAN_PG!AU131","v":""},{"$f":"JAWABAN_PG!AV131","v":""},{"$f":"JAWABAN_PG!AW131","v":""},{"$f":"JAWABAN_PG!AX131","v":""},{"$f":"JAWABAN_PG!AY131","v":""},{"$f":"JAWABAN_PG!AZ131","v":""},{"$f":"JAWABAN_PG!BA131","v":""},0,{"$f":"IF(BB42>=DATA!$G$15,\"TUNTAS\",\"BELUM TUNTAS\")","v":"BELUM TUNTAS"}]
[36,{"$f":"IF(VALUE(DATA!B41)=0, \"\", TEXT(VALUE(DATA!B41), REPT(\"0\", LEN(DATA!B41))))","v":""},{"$f":"IF(DATA!C41=\"\",\"\",DATA!C41)","v":""},{"$f":"JAWABAN_PG!D132","v":""},{"$f":"JAWABAN_PG!E132","v":""},{"$f":"JAWABAN_PG!F132","v":""},{"$f":"JAWABAN_PG!G132","v":""},{"$f":"JAWABAN_PG!H132","v":""},{"$f":"JAWABAN_PG!I132","v":""},{"$f":"JAWABAN_PG!J132","v":""},{"$f":"JAWABAN_PG!K132","v":""},{"$f":"JAWABAN_PG!L132","v":""},{"$f":"JAWABAN_PG!M132","v":""},{"$f":"JAWABAN_PG!N132","v":""},{"$f":"JAWABAN_PG!O132","v":""},{"$f":"JAWABAN_PG!P132","v":""},{"$f":"JAWABAN_PG!Q132","v":""},{"$f":"JAWABAN_PG!R132","v":""},{"$f":"JAWABAN_PG!S132","v":""},{"$f":"JAWABAN_PG!T132","v":""},{"$f":"JAWABAN_PG!U132","v":""},{"$f":"JAWABAN_PG!V132","v":""},{"$f":"JAWABAN_PG!W132","v":""},{"$f":"JAWABAN_PG!X132","v":""},{"$f":"JAWABAN_PG!Y132","v":""},{"$f":"JAWABAN_PG!Z132","v":""},{"$f":"JAWABAN_PG!AA132","v":""},{"$f":"JAWABAN_PG!AB132","v":""},{"$f":"JAWABAN_PG!AC132","v":""},{"$f":"JAWABAN_PG!AD132","v":""},{"$f":"JAWABAN_PG!AE132","v":""},{"$f":"JAWABAN_PG!AF132","v":""},{"$f":"JAWABAN_PG!AG132","v":""},{"$f":"JAWABAN_PG!AH132","v":""},{"$f":"JAWABAN_PG!AI132","v":""},{"$f":"JAWABAN_PG!AJ132","v":""},{"$f":"JAWABAN_PG!AK132","v":""},{"$f":"JAWABAN_PG!AL132","v":""},{"$f":"JAWABAN_PG!AM132","v":""},{"$f":"JAWABAN_PG!AN132","v":""},{"$f":"JAWABAN_PG!AO132","v":""},{"$f":"JAWABAN_PG!AP132","v":""},{"$f":"JAWABAN_PG!AQ132","v":""},{"$f":"JAWABAN_PG!AR132","v":""},{"$f":"JAWABAN_PG!AS132","v":""},{"$f":"JAWABAN_PG!AT132","v":""},{"$f":"JAWABAN_PG!AU132","v":""},{"$f":"JAWABAN_PG!AV132","v":""},{"$f":"JAWABAN_PG!AW132","v":""},{"$f":"JAWABAN_PG!AX132","v":""},{"$f":"JAWABAN_PG!AY132","v":""},{"$f":"JAWABAN_PG!AZ132","v":""},{"$f":"JAWABAN_PG!BA132","v":""},0,{"$f":"IF(BB43>=DATA!$G$15,\"TUNTAS\",\"BELUM TUNTAS\")","v":"BELUM TUNTAS"}]
[37,{"$f":"IF(VALUE(DATA!B42)=0, \"\", TEXT(VALUE(DATA!B42), REPT(\"0\", LEN(DATA!B42))))","v":""},{"$f":"IF(DATA!C42=\"\",\"\",DATA!C42)","v":""},{"$f":"JAWABAN_PG!D133","v":""},{"$f":"JAWABAN_PG!E133","v":""},{"$f":"JAWABAN_PG!F133","v":""},{"$f":"JAWABAN_PG!G133","v":""},{"$f":"JAWABAN_PG!H133","v":""},{"$f":"JAWABAN_PG!I133","v":""},{"$f":"JAWABAN_PG!J133","v":""},{"$f":"JAWABAN_PG!K133","v":""},{"$f":"JAWABAN_PG!L133","v":""},{"$f":"JAWABAN_PG!M133","v":""},{"$f":"JAWABAN_PG!N133","v":""},{"$f":"JAWABAN_PG!O133","v":""},{"$f":"JAWABAN_PG!P133","v":""},{"$f":"JAWABAN_PG!Q133","v":""},{"$f":"JAWABAN_PG!R133","v":""},{"$f":"JAWABAN_PG!S133","v":""},{"$f":"JAWABAN_PG!T133","v":""},{"$f":"JAWABAN_PG!U133","v":""},{"$f":"JAWABAN_PG!V133","v":""},{"$f":"JAWABAN_PG!W133","v":""},{"$f":"JAWABAN_PG!X133","v":""},{"$f":"JAWABAN_PG!Y133","v":""},{"$f":"JAWABAN_PG!Z133","v":""},{"$f":"JAWABAN_PG!AA133","v":""},{"$f":"JAWABAN_PG!AB133","v":""},{"$f":"JAWABAN_PG!AC133","v":""},{"$f":"JAWABAN_PG!AD133","v":""},{"$f":"JAWABAN_PG!AE133","v":""},{"$f":"JAWABAN_PG!AF133","v":""},{"$f":"JAWABAN_PG!AG133","v":""},{"$f":"JAWABAN_PG!AH133","v":""},{"$f":"JAWABAN_PG!AI133","v":""},{"$f":"JAWABAN_PG!AJ133","v":""},{"$f":"JAWABAN_PG!AK133","v":""},{"$f":"JAWABAN_PG!AL133","v":""},{"$f":"JAWABAN_PG!AM133","v":""},{"$f":"JAWABAN_PG!AN133","v":""},{"$f":"JAWABAN_PG!AO133","v":""},{"$f":"JAWABAN_PG!AP133","v":""},{"$f":"JAWABAN_PG!AQ133","v":""},{"$f":"JAWABAN_PG!AR133","v":""},{"$f":"JAWABAN_PG!AS133","v":""},{"$f":"JAWABAN_PG!AT133","v":""},{"$f":"JAWABAN_PG!AU133","v":""},{"$f":"JAWABAN_PG!AV133","v":""},{"$f":"JAWABAN_PG!AW133","v":""},{"$f":"JAWABAN_PG!AX133","v":""},{"$f":"JAWABAN_PG!AY133","v":""},{"$f":"JAWABAN_PG!AZ133","v":""},{"$f":"JAWABAN_PG!BA133","v":""},0,{"$f":"IF(BB44>=DATA!$G$15,\"TUNTAS\",\"BELUM TUNTAS\")","v":"BELUM TUNTAS"}]
[38,{"$f":"IF(VALUE(DATA!B43)=0, \"\", TEXT(VALUE(DATA!B43), REPT(\"0\", LEN(DATA!B43))))","v":""},{"$f":"IF(DATA!C43=\"\",\"\",DATA!C43)","v":""},{"$f":"JAWABAN_PG!D134","v":""},{"$f":"JAWABAN_PG!E134","v":""},{"$f":"JAWABAN_PG!F134","v":""},{"$f":"JAWABAN_PG!G134","v":""},{"$f":"JAWABAN_PG!H134","v":""},{"$f":"JAWABAN_PG!I134","v":""},{"$f":"JAWABAN_PG!J134","v":""},{"$f":"JAWABAN_PG!K134","v":""},{"$f":"JAWABAN_PG!L134","v":""},{"$f":"JAWABAN_PG!M134","v":""},{"$f":"JAWABAN_PG!N134","v":""},{"$f":"JAWABAN_PG!O134","v":""},{"$f":"JAWABAN_PG!P134","v":""},{"$f":"JAWABAN_PG!Q134","v":""},{"$f":"JAWABAN_PG!R134","v":""},{"$f":"JAWABAN_PG!S134","v":""},{"$f":"JAWABAN_PG!T134","v":""},{"$f":"JAWABAN_PG!U134","v":""},{"$f":"JAWABAN_PG!V134","v":""},{"$f":"JAWABAN_PG!W134","v":""},{"$f":"JAWABAN_PG!X134","v":""},{"$f":"JAWABAN_PG!Y134","v":""},{"$f":"JAWABAN_PG!Z134","v":""},{"$f":"JAWABAN_PG!AA134","v":""},{"$f":"JAWABAN_PG!AB134","v":""},{"$f":"JAWABAN_PG!AC134","v":""},{"$f":"JAWABAN_PG!AD134","v":""},{"$f":"JAWABAN_PG!AE134","v":""},{"$f":"JAWABAN_PG!AF134","v":""},{"$f":"JAWABAN_PG!AG134","v":""},{"$f":"JAWABAN_PG!AH134","v":""},{"$f":"JAWABAN_PG!AI134","v":""},{"$f":"JAWABAN_PG!AJ134","v":""},{"$f":"JAWABAN_PG!AK134","v":""},{"$f":"JAWABAN_PG!AL134","v":""},{"$f":"JAWABAN_PG!AM134","v":""},{"$f":"JAWABAN_PG!AN134","v":""},{"$f":"JAWABAN_PG!AO134","v":""},{"$f":"JAWABAN_PG!AP134","v":""},{"$f":"JAWABAN_PG!AQ134","v":""},{"$f":"JAWABAN_PG!AR134","v":""},{"$f":"JAWABAN_PG!AS134","v":""},{"$f":"JAWABAN_PG!AT134","v":""},{"$f":"JAWABAN_PG!AU134","v":""},{"$f":"JAWABAN_PG!AV134","v":""},{"$f":"JAWABAN_PG!AW134","v":""},{"$f":"JAWABAN_PG!AX134","v":""},{"$f":"JAWABAN_PG!AY134","v":""},{"$f":"JAWABAN_PG!AZ134","v":""},{"$f":"JAWABAN_PG!BA134","v":""},0,{"$f":"IF(BB45>=DATA!$G$15,\"TUNTAS\",\"BELUM TUNTAS\")","v":"BELUM TUNTAS"}]
[39,{"$f":"IF(VALUE(DATA!B44)=0, \"\", TEXT(VALUE(DATA!B44), REPT(\"0\", LEN(DATA!B44))))","v":""},{"$f":"IF(DATA!C44=\"\",\"\",DATA!C44)","v":""},{"$f":"JAWABAN_PG!D135","v":""},{"$f":"JAWABAN_PG!E135","v":""},{"$f":"JAWABAN_PG!F135","v":""},{"$f":"JAWABAN_PG!G135","v":""},{"$f":"JAWABAN_PG!H135","v":""},{"$f":"JAWABAN_PG!I135","v":""},{"$f":"JAWABAN_PG!J135","v":""},{"$f":"JAWABAN_PG!K135","v":""},{"$f":"JAWABAN_PG!L135","v":""},{"$f":"JAWABAN_PG!M135","v":""},{"$f":"JAWABAN_PG!N135","v":""},{"$f":"JAWABAN_PG!O135","v":""},{"$f":"JAWABAN_PG!P135","v":""},{"$f":"JAWABAN_PG!Q135","v":""},{"$f":"JAWABAN_PG!R135","v":""},{"$f":"JAWABAN_PG!S135","v":""},{"$f":"JAWABAN_PG!T135","v":""},{"$f":"JAWABAN_PG!U135","v":""},{"$f":"JAWABAN_PG!V135","v":""},{"$f":"JAWABAN_PG!W135","v":""},{"$f":"JAWABAN_PG!X135","v":""},{"$f":"JAWABAN_PG!Y135","v":""},{"$f":"JAWABAN_PG!Z135","v":""},{"$f":"JAWABAN_PG!AA135","v":""},{"$f":"JAWABAN_PG!AB135","v":""},{"$f":"JAWABAN_PG!AC135","v":""},{"$f":"JAWABAN_PG!AD135","v":""},{"$f":"JAWABAN_PG!AE135","v":""},{"$f":"JAWABAN_PG!AF135","v":""},{"$f":"JAWABAN_PG!AG135","v":""},{"$f":"JAWABAN_PG!AH135","v":""},{"$f":"JAWABAN_PG!AI135","v":""},{"$f":"JAWABAN_PG!AJ135","v":""},{"$f":"JAWABAN_PG!AK135","v":""},{"$f":"JAWABAN_PG!AL135","v":""},{"$f":"JAWABAN_PG!AM135","v":""},{"$f":"JAWABAN_PG!AN135","v":""},{"$f":"JAWABAN_PG!AO135","v":""},{"$f":"JAWABAN_PG!AP135","v":""},{"$f":"JAWABAN_PG!AQ135","v":""},{"$f":"JAWABAN_PG!AR135","v":""},{"$f":"JAWABAN_PG!AS135","v":""},{"$f":"JAWABAN_PG!AT135","v":""},{"$f":"JAWABAN_PG!AU135","v":""},{"$f":"JAWABAN_PG!AV135","v":""},{"$f":"JAWABAN_PG!AW135","v":""},{"$f":"JAWABAN_PG!AX135","v":""},{"$f":"JAWABAN_PG!AY135","v":""},{"$f":"JAWABAN_PG!AZ135","v":""},{"$f":"JAWABAN_PG!BA135","v":""},0,{"$f":"IF(BB46>=DATA!$G$15,\"TUNTAS\",\"BELUM TUNTAS\")","v":"BELUM TUNTAS"}]
[40,{"$f":"IF(VALUE(DATA!B45)=0, \"\", TEXT(VALUE(DATA!B45), REPT(\"0\", LEN(DATA!B45))))","v":""},{"$f":"IF(DATA!C45=\"\",\"\",DATA!C45)","v":""},{"$f":"JAWABAN_PG!D136","v":""},{"$f":"JAWABAN_PG!E136","v":""},{"$f":"JAWABAN_PG!F136","v":""},{"$f":"JAWABAN_PG!G136","v":""},{"$f":"JAWABAN_PG!H136","v":""},{"$f":"JAWABAN_PG!I136","v":""},{"$f":"JAWABAN_PG!J136","v":""},{"$f":"JAWABAN_PG!K136","v":""},{"$f":"JAWABAN_PG!L136","v":""},{"$f":"JAWABAN_PG!M136","v":""},{"$f":"JAWABAN_PG!N136","v":""},{"$f":"JAWABAN_PG!O136","v":""},{"$f":"JAWABAN_PG!P136","v":""},{"$f":"JAWABAN_PG!Q136","v":""},{"$f":"JAWABAN_PG!R136","v":""},{"$f":"JAWABAN_PG!S136","v":""},{"$f":"JAWABAN_PG!T136","v":""},{"$f":"JAWABAN_PG!U136","v":""},{"$f":"JAWABAN_PG!V136","v":""},{"$f":"JAWABAN_PG!W136","v":""},{"$f":"JAWABAN_PG!X136","v":""},{"$f":"JAWABAN_PG!Y136","v":""},{"$f":"JAWABAN_PG!Z136","v":""},{"$f":"JAWABAN_PG!AA136","v":""},{"$f":"JAWABAN_PG!AB136","v":""},{"$f":"JAWABAN_PG!AC136","v":""},{"$f":"JAWABAN_PG!AD136","v":""},{"$f":"JAWABAN_PG!AE136","v":""},{"$f":"JAWABAN_PG!AF136","v":""},{"$f":"JAWABAN_PG!AG136","v":""},{"$f":"JAWABAN_PG!AH136","v":""},{"$f":"JAWABAN_PG!AI136","v":""},{"$f":"JAWABAN_PG!AJ136","v":""},{"$f":"JAWABAN_PG!AK136","v":""},{"$f":"JAWABAN_PG!AL136","v":""},{"$f":"JAWABAN_PG!AM136","v":""},{"$f":"JAWABAN_PG!AN136","v":""},{"$f":"JAWABAN_PG!AO136","v":""},{"$f":"JAWABAN_PG!AP136","v":""},{"$f":"JAWABAN_PG!AQ136","v":""},{"$f":"JAWABAN_PG!AR136","v":""},{"$f":"JAWABAN_PG!AS136","v":""},{"$f":"JAWABAN_PG!AT136","v":""},{"$f":"JAWABAN_PG!AU136","v":""},{"$f":"JAWABAN_PG!AV136","v":""},{"$f":"JAWABAN_PG!AW136","v":""},{"$f":"JAWABAN_PG!AX136","v":""},{"$f":"JAWABAN_PG!AY136","v":""},{"$f":"JAWABAN_PG!AZ136","v":""},{"$f":"JAWABAN_PG!BA136","v":""},0,{"$f":"IF(BB47>=DATA!$G$15,\"TUNTAS\",\"BELUM TUNTAS\")","v":"BELUM TUNTAS"}]
[null,null,"Jumlah Benar",{"$f":"JAWABAN_PG!D94","v":0},{"$f":"JAWABAN_PG!E94","v":12},{"$f":"JAWABAN_PG!F94","v":14},{"$f":"JAWABAN_PG!G94","v":5},{"$f":"JAWABAN_PG!H94","v":22},{"$f":"JAWABAN_PG!I94","v":22},{"$f":"JAWABAN_PG!J94","v":21},{"$f":"JAWABAN_PG!K94","v":11},{"$f":"JAWABAN_PG!L94","v":0},{"$f":"JAWABAN_PG!M94","v":12},{"$f":"JAWABAN_PG!N94","v":17},{"$f":"JAWABAN_PG!O94","v":0},{"$f":"JAWABAN_PG!P94","v":22},{"$f":"JAWABAN_PG!Q94","v":21},{"$f":"JAWABAN_PG!R94","v":9},{"$f":"JAWABAN_PG!S94","v":7},{"$f":"JAWABAN_PG!T94","v":3},{"$f":"JAWABAN_PG!U94","v":20},{"$f":"JAWABAN_PG!V94","v":21},{"$f":"JAWABAN_PG!W94","v":22},{"$f":"JAWABAN_PG!X94","v":""},{"$f":"JAWABAN_PG!Y94","v":""},{"$f":"JAWABAN_PG!Z94","v":""},{"$f":"JAWABAN_PG!AA94","v":""},{"$f":"JAWABAN_PG!AB94","v":""},{"$f":"JAWABAN_PG!AC94","v":""},{"$f":"JAWABAN_PG!AD94","v":""},{"$f":"JAWABAN_PG!AE94","v":""},{"$f":"JAWABAN_PG!AF94","v":""},{"$f":"JAWABAN_PG!AG94","v":""},{"$f":"JAWABAN_PG!AH94","v":""},{"$f":"JAWABAN_PG!AI94","v":""},{"$f":"JAWABAN_PG!AJ94","v":""},{"$f":"JAWABAN_PG!AK94","v":""},{"$f":"JAWABAN_PG!AL94","v":""},{"$f":"JAWABAN_PG!AM94","v":""},{"$f":"JAWABAN_PG!AN94","v":""},{"$f":"JAWABAN_PG!AO94","v":""},{"$f":"JAWABAN_PG!AP94","v":""},{"$f":"JAWABAN_PG!AQ94","v":""},{"$f":"JAWABAN_PG!AR94","v":""},{"$f":"JAWABAN_PG!AS94","v":""},{"$f":"JAWABAN_PG!AT94","v":""},{"$f":"JAWABAN_PG!AU94","v":""},{"$f":"JAWABAN_PG!AV94","v":""},{"$f":"JAWABAN_PG!AW94","v":""},{"$f":"JAWABAN_PG!AX94","v":""},{"$f":"JAWABAN_PG!AY94","v":""},{"$f":"JAWABAN_PG!AZ94","v":""},{"$f":"JAWABAN_PG!BA94","v":""},"Maks.",{"$f":"MAX(BB8:BB47)","v":80}]
[null,null,"Jumlah Salah",{"$f":"JAWABAN_PG!D95","v":23},{"$f":"JAWABAN_PG!E95","v":11},{"$f":"JAWABAN_PG!F95","v":9},{"$f":"JAWABAN_PG!G95","v":18},{"$f":"JAWABAN_PG!H95","v":1},{"$f":"JAWABAN_PG!I95","v":1},{"$f":"JAWABAN_PG!J95","v":2},{"$f":"JAWABAN_PG!K95","v":12},{"$f":"JAWABAN_PG!L95","v":23},{"$f":"JAWABAN_PG!M95","v":11},{"$f":"JAWABAN_PG!N95","v":6},{"$f":"JAWABAN_PG!O95","v":23},{"$f":"JAWABAN_PG!P95","v":1},{"$f":"JAWABAN_PG!Q95","v":2},{"$f":"JAWABAN_PG!R95","v":14},{"$f":"JAWABAN_PG!S95","v":16},{"$f":"JAWABAN_PG!T95","v":20},{"$f":"JAWABAN_PG!U95","v":3},{"$f":"JAWABAN_PG!V95","v":2},{"$f":"JAWABAN_PG!W95","v":1},{"$f":"JAWABAN_PG!X95","v":""},{"$f":"JAWABAN_PG!Y95","v":""},{"$f":"JAWABAN_PG!Z95","v":""},{"$f":"JAWABAN_PG!AA95","v":""},{"$f":"JAWABAN_PG!AB95","v":""},{"$f":"JAWABAN_PG!AC95","v":""},{"$f":"JAWABAN_PG!AD95","v":""},{"$f":"JAWABAN_PG!AE95","v":""},{"$f":"JAWABAN_PG!AF95","v":""},{"$f":"JAWABAN_PG!AG95","v":""},{"$f":"JAWABAN_PG!AH95","v":""},{"$f":"JAWABAN_PG!AI95","v":""},{"$f":"JAWABAN_PG!AJ95","v":""},{"$f":"JAWABAN_PG!AK95","v":""},{"$f":"JAWABAN_PG!AL95","v":""},{"$f":"JAWABAN_PG!AM95","v":""},{"$f":"JAWABAN_PG!AN95","v":""},{"$f":"JAWABAN_PG!AO95","v":""},{"$f":"JAWABAN_PG!AP95","v":""},{"$f":"JAWABAN_PG!AQ95","v":""},{"$f":"JAWABAN_PG!AR95","v":""},{"$f":"JAWABAN_PG!AS95","v":""},{"$f":"JAWABAN_PG!AT95","v":""},{"$f":"JAWABAN_PG!AU95","v":""},{"$f":"JAWABAN_PG!AV95","v":""},{"$f":"JAWABAN_PG!AW95","v":""},{"$f":"JAWABAN_PG!AX95","v":""},{"$f":"JAWABAN_PG!AY95","v":""},{"$f":"JAWABAN_PG!AZ95","v":""},{"$f":"JAWABAN_PG!BA95","v":""},"Min.",{"$f":"MIN(BB8:BB47)","v":0}]
[null,null,"Jumlah Siswa Menjawab",{"$f":"IFERROR(D48+D49,\"\")","v":23},{"$f":"IFERROR(E48+E49,\"\")","v":23},23,23,23,23,23,23,23,23,23,23,23,23,23,23,23,23,23,23,"","","","","","","","","","","","","","","","","","","","","","","","","","","","","","","Rerata",{"$f":"SUM(BB8:BB47) / COUNTIF(BB8:BB47,\">0\")","v":56.739130434782609}]
[null,null,"Nilai Maksimum",{"$f":"JAWABAN_PG!D90","v":0},{"$f":"JAWABAN_PG!E90","v":5},{"$f":"JAWABAN_PG!F90","v":5},{"$f":"JAWABAN_PG!G90","v":5},{"$f":"JAWABAN_PG!H90","v":5},{"$f":"JAWABAN_PG!I90","v":5},{"$f":"JAWABAN_PG!J90","v":5},{"$f":"JAWABAN_PG!K90","v":5},{"$f":"JAWABAN_PG!L90","v":0},{"$f":"JAWABAN_PG!M90","v":5},{"$f":"JAWABAN_PG!N90","v":5},{"$f":"JAWABAN_PG!O90","v":0},{"$f":"JAWABAN_PG!P90","v":5},{"$f":"JAWABAN_PG!Q90","v":5},{"$f":"JAWABAN_PG!R90","v":5},{"$f":"JAWABAN_PG!S90","v":5},{"$f":"JAWABAN_PG!T90","v":5},{"$f":"JAWABAN_PG!U90","v":5},{"$f":"JAWABAN_PG!V90","v":5},{"$f":"JAWABAN_PG!W90","v":5},{"$f":"JAWABAN_PG!X90","v":""},{"$f":"JAWABAN_PG!Y90","v":""},{"$f":"JAWABAN_PG!Z90","v":""},{"$f":"JAWABAN_PG!AA90","v":""},{"$f":"JAWABAN_PG!AB90","v":""},{"$f":"JAWABAN_PG!AC90","v":""},{"$f":"JAWABAN_PG!AD90","v":""},{"$f":"JAWABAN_PG!AE90","v":""},{"$f":"JAWABAN_PG!AF90","v":""},{"$f":"JAWABAN_PG!AG90","v":""},{"$f":"JAWABAN_PG!AH90","v":""},{"$f":"JAWABAN_PG!AI90","v":""},{"$f":"JAWABAN_PG!AJ90","v":""},{"$f":"JAWABAN_PG!AK90","v":""},{"$f":"JAWABAN_PG!AL90","v":""},{"$f":"JAWABAN_PG!AM90","v":""},{"$f":"JAWABAN_PG!AN90","v":""},{"$f":"JAWABAN_PG!AO90","v":""},{"$f":"JAWABAN_PG!AP90","v":""},{"$f":"JAWABAN_PG!AQ90","v":""},{"$f":"JAWABAN_PG!AR90","v":""},{"$f":"JAWABAN_PG!AS90","v":""},{"$f":"JAWABAN_PG!AT90","v":""},{"$f":"JAWABAN_PG!AU90","v":""},{"$f":"JAWABAN_PG!AV90","v":""},{"$f":"JAWABAN_PG!AW90","v":""},{"$f":"JAWABAN_PG!AX90","v":""},{"$f":"JAWABAN_PG!AY90","v":""},{"$f":"JAWABAN_PG!AZ90","v":""},{"$f":"JAWABAN_PG!BA90","v":""},"Jml. T",{"$f":"COUNTIF(BC8:BC47,\"TUNTAS\")","v":2}]
[null,null,"Nilai Minimum",{"$f":"JAWABAN_PG!D91","v":0},{"$f":"JAWABAN_PG!E91","v":0},{"$f":"JAWABAN_PG!F91","v":0},{"$f":"JAWABAN_PG!G91","v":0},{"$f":"JAWABAN_PG!H91","v":0},{"$f":"JAWABAN_PG!I91","v":0},{"$f":"JAWABAN_PG!J91","v":0},{"$f":"JAWABAN_PG!K91","v":0},{"$f":"JAWABAN_PG!L91","v":0},{"$f":"JAWABAN_PG!M91","v":0},{"$f":"JAWABAN_PG!N91","v":0},{"$f":"JAWABAN_PG!O91","v":0},{"$f":"JAWABAN_PG!P91","v":0},{"$f":"JAWABAN_PG!Q91","v":0},{"$f":"JAWABAN_PG!R91","v":0},{"$f":"JAWABAN_PG!S91","v":0},{"$f":"JAWABAN_PG!T91","v":0},{"$f":"JAWABAN_PG!U91","v":0},{"$f":"JAWABAN_PG!V91","v":0},{"$f":"JAWABAN_PG!W91","v":0},{"$f":"JAWABAN_PG!X91","v":""},{"$f":"JAWABAN_PG!Y91","v":""},{"$f":"JAWABAN_PG!Z91","v":""},{"$f":"JAWABAN_PG!AA91","v":""},{"$f":"JAWABAN_PG!AB91","v":""},{"$f":"JAWABAN_PG!AC91","v":""},{"$f":"JAWABAN_PG!AD91","v":""},{"$f":"JAWABAN_PG!AE91","v":""},{"$f":"JAWABAN_PG!AF91","v":""},{"$f":"JAWABAN_PG!AG91","v":""},{"$f":"JAWABAN_PG!AH91","v":""},{"$f":"JAWABAN_PG!AI91","v":""},{"$f":"JAWABAN_PG!AJ91","v":""},{"$f":"JAWABAN_PG!AK91","v":""},{"$f":"JAWABAN_PG!AL91","v":""},{"$f":"JAWABAN_PG!AM91","v":""},{"$f":"JAWABAN_PG!AN91","v":""},{"$f":"JAWABAN_PG!AO91","v":""},{"$f":"JAWABAN_PG!AP91","v":""},{"$f":"JAWABAN_PG!AQ91","v":""},{"$f":"JAWABAN_PG!AR91","v":""},{"$f":"JAWABAN_PG!AS91","v":""},{"$f":"JAWABAN_PG!AT91","v":""},{"$f":"JAWABAN_PG!AU91","v":""},{"$f":"JAWABAN_PG!AV91","v":""},{"$f":"JAWABAN_PG!AW91","v":""},{"$f":"JAWABAN_PG!AX91","v":""},{"$f":"JAWABAN_PG!AY91","v":""},{"$f":"JAWABAN_PG!AZ91","v":""},{"$f":"JAWABAN_PG!BA91","v":""},"Jml. Psrt",{"$f":"DATA!G23","v":24}]
[null,null,"Rerata",{"$f":"JAWABAN_PG!D96","v":0},{"$f":"JAWABAN_PG!E96","v":2.6086956521739131},{"$f":"JAWABAN_PG!F96","v":3.0434782608695654},{"$f":"JAWABAN_PG!G96","v":1.0869565217391304},{"$f":"JAWABAN_PG!H96","v":4.7826086956521738},{"$f":"JAWABAN_PG!I96","v":4.7826086956521738},{"$f":"JAWABAN_PG!J96","v":4.5652173913043477},{"$f":"JAWABAN_PG!K96","v":2.3913043478260869},{"$f":"JAWABAN_PG!L96","v":0},{"$f":"JAWABAN_PG!M96","v":2.6086956521739131},{"$f":"JAWABAN_PG!N96","v":3.6956521739130435},{"$f":"JAWABAN_PG!O96","v":0},{"$f":"JAWABAN_PG!P96","v":4.7826086956521738},{"$f":"JAWABAN_PG!Q96","v":4.5652173913043477},{"$f":"JAWABAN_PG!R96","v":1.9565217391304348},{"$f":"JAWABAN_PG!S96","v":1.5217391304347827},{"$f":"JAWABAN_PG!T96","v":0.65217391304347827},{"$f":"JAWABAN_PG!U96","v":4.3478260869565215},{"$f":"JAWABAN_PG!V96","v":4.5652173913043477},{"$f":"JAWABAN_PG!W96","v":4.7826086956521738},{"$f":"JAWABAN_PG!X96","v":""},{"$f":"JAWABAN_PG!Y96","v":""},{"$f":"JAWABAN_PG!Z96","v":""},{"$f":"JAWABAN_PG!AA96","v":""},{"$f":"JAWABAN_PG!AB96","v":""},{"$f":"JAWABAN_PG!AC96","v":""},{"$f":"JAWABAN_PG!AD96","v":""},{"$f":"JAWABAN_PG!AE96","v":""},{"$f":"JAWABAN_PG!AF96","v":""},{"$f":"JAWABAN_PG!AG96","v":""},{"$f":"JAWABAN_PG!AH96","v":""},{"$f":"JAWABAN_PG!AI96","v":""},{"$f":"JAWABAN_PG!AJ96","v":""},{"$f":"JAWABAN_PG!AK96","v":""},{"$f":"JAWABAN_PG!AL96","v":""},{"$f":"JAWABAN_PG!AM96","v":""},{"$f":"JAWABAN_PG!AN96","v":""},{"$f":"JAWABAN_PG!AO96","v":""},{"$f":"JAWABAN_PG!AP96","v":""},{"$f":"JAWABAN_PG!AQ96","v":""},{"$f":"JAWABAN_PG!AR96","v":""},{"$f":"JAWABAN_PG!AS96","v":""},{"$f":"JAWABAN_PG!AT96","v":""},{"$f":"JAWABAN_PG!AU96","v":""},{"$f":"JAWABAN_PG!AV96","v":""},{"$f":"JAWABAN_PG!AW96","v":""},{"$f":"JAWABAN_PG!AX96","v":""},{"$f":"JAWABAN_PG!AY96","v":""},{"$f":"JAWABAN_PG!AZ96","v":""},{"$f":"JAWABAN_PG!BA96","v":""},"Jml. Soal",{"$f":"JAWABAN_PG!BB8","v":20}]
[null,null,"Simpangan Baku",{"$f":"IF(COUNT(D8:D47)=0,\"\",_xlfn.STDEV.S(IF(D8:D47<>\"\",D8:D47)))","v":0},{"$f":"IF(COUNT(E8:E47)=0,\"\",_xlfn.STDEV.S(IF(E8:E47<>\"\",E8:E47)))","v":2.5537695922762458},{"$f":"IF(COUNT(F8:F47)=0,\"\",_xlfn.STDEV.S(IF(F8:F47<>\"\",F8:F47)))","v":2.4950543967392269},{"$f":"IF(COUNT(G8:G47)=0,\"\",_xlfn.STDEV.S(IF(G8:G47<>\"\",G8:G47)))","v":2.1087058391832496},{"$f":"IF(COUNT(H8:H47)=0,\"\",_xlfn.STDEV.S(IF(H8:H47<>\"\",H8:H47)))","v":1.0425720702853738},{"$f":"IF(COUNT(I8:I47)=0,\"\",_xlfn.STDEV.S(IF(I8:I47<>\"\",I8:I47)))","v":1.0425720702853738},{"$f":"IF(COUNT(J8:J47)=0,\"\",_xlfn.STDEV.S(IF(J8:J47<>\"\",J8:J47)))","v":1.4405203276001521},{"$f":"IF(COUNT(K8:K47)=0,\"\",_xlfn.STDEV.S(IF(K8:K47<>\"\",K8:K47)))","v":2.5537695922762458},{"$f":"IF(COUNT(L8:L47)=0,\"\",_xlfn.STDEV.S(IF(L8:L47<>\"\",L8:L47)))","v":0},{"$f":"IF(COUNT(M8:M47)=0,\"\",_xlfn.STDEV.S(IF(M8:M47<>\"\",M8:M47)))","v":2.5537695922762458},{"$f":"IF(COUNT(N8:N47)=0,\"\",_xlfn.STDEV.S(IF(N8:N47<>\"\",N8:N47)))","v":2.2448887927243981},{"$f":"IF(COUNT(O8:O47)=0,\"\",_xlfn.STDEV.S(IF(O8:O47<>\"\",O8:O47)))","v":0},{"$f":"IF(COUNT(P8:P47)=0,\"\",_xlfn.STDEV.S(IF(P8:P47<>\"\",P8:P47)))","v":1.0425720702853738},{"$f":"IF(COUNT(Q8:Q47)=0,\"\",_xlfn.STDEV.S(IF(Q8:Q47<>\"\",Q8:Q47)))","v":1.4405203276001521},{"$f":"IF(COUNT(R8:R47)=0,\"\",_xlfn.STDEV.S(IF(R8:R47<>\"\",R8:R47)))","v":2.4950543967392269},{"$f":"IF(COUNT(S8:S47)=0,\"\",_xlfn.STDEV.S(IF(S8:S47<>\"\",S8:S47)))","v":2.3523598444848237},{"$f":"IF(COUNT(T8:T47)=0,\"\",_xlfn.STDEV.S(IF(T8:T47<>\"\",T8:T47)))","v":1.7217511078754548},{"$f":"IF(COUNT(U8:U47)=0,\"\",_xlfn.STDEV.S(IF(U8:U47<>\"\",U8:U47)))","v":1.7217511078754546},{"$f":"IF(COUNT(V8:V47)=0,\"\",_xlfn.STDEV.S(IF(V8:V47<>\"\",V8:V47)))","v":1.4405203276001521},{"$f":"IF(COUNT(W8:W47)=0,\"\",_xlfn.STDEV.S(IF(W8:W47<>\"\",W8:W47)))","v":1.0425720702853738},{"$f":"IF(COUNT(X8:X47)=0,\"\",_xlfn.STDEV.S(IF(X8:X47<>\"\",X8:X47)))","v":""},{"$f":"IF(COUNT(Y8:Y47)=0,\"\",_xlfn.STDEV.S(IF(Y8:Y47<>\"\",Y8:Y47)))","v":""},{"$f":"IF(COUNT(Z8:Z47)=0,\"\",_xlfn.STDEV.S(IF(Z8:Z47<>\"\",Z8:Z47)))","v":""},{"$f":"IF(COUNT(AA8:AA47)=0,\"\",_xlfn.STDEV.S(IF(AA8:AA47<>\"\",AA8:AA47)))","v":""},{"$f":"IF(COUNT(AB8:AB47)=0,\"\",_xlfn.STDEV.S(IF(AB8:AB47<>\"\",AB8:AB47)))","v":""},{"$f":"IF(COUNT(AC8:AC47)=0,\"\",_xlfn.STDEV.S(IF(AC8:AC47<>\"\",AC8:AC47)))","v":""},{"$f":"IF(COUNT(AD8:AD47)=0,\"\",_xlfn.STDEV.S(IF(AD8:AD47<>\"\",AD8:AD47)))","v":""},{"$f":"IF(COUNT(AE8:AE47)=0,\"\",_xlfn.STDEV.S(IF(AE8:AE47<>\"\",AE8:AE47)))","v":""},{"$f":"IF(COUNT(AF8:AF47)=0,\"\",_xlfn.STDEV.S(IF(AF8:AF47<>\"\",AF8:AF47)))","v":""},{"$f":"IF(COUNT(AG8:AG47)=0,\"\",_xlfn.STDEV.S(IF(AG8:AG47<>\"\",AG8:AG47)))","v":""},{"$f":"IF(COUNT(AH8:AH47)=0,\"\",_xlfn.STDEV.S(IF(AH8:AH47<>\"\",AH8:AH47)))","v":""},{"$f":"IF(COUNT(AI8:AI47)=0,\"\",_xlfn.STDEV.S(IF(AI8:AI47<>\"\",AI8:AI47)))","v":""},{"$f":"IF(COUNT(AJ8:AJ47)=0,\"\",_xlfn.STDEV.S(IF(AJ8:AJ47<>\"\",AJ8:AJ47)))","v":""},{"$f":"IF(COUNT(AK8:AK47)=0,\"\",_xlfn.STDEV.S(IF(AK8:AK47<>\"\",AK8:AK47)))","v":""},{"$f":"IF(COUNT(AL8:AL47)=0,\"\",_xlfn.STDEV.S(IF(AL8:AL47<>\"\",AL8:AL47)))","v":""},{"$f":"IF(COUNT(AM8:AM47)=0,\"\",_xlfn.STDEV.S(IF(AM8:AM47<>\"\",AM8:AM47)))","v":""},{"$f":"IF(COUNT(AN8:AN47)=0,\"\",_xlfn.STDEV.S(IF(AN8:AN47<>\"\",AN8:AN47)))","v":""},{"$f":"IF(COUNT(AO8:AO47)=0,\"\",_xlfn.STDEV.S(IF(AO8:AO47<>\"\",AO8:AO47)))","v":""},{"$f":"IF(COUNT(AP8:AP47)=0,\"\",_xlfn.STDEV.S(IF(AP8:AP47<>\"\",AP8:AP47)))","v":""},{"$f":"IF(COUNT(AQ8:AQ47)=0,\"\",_xlfn.STDEV.S(IF(AQ8:AQ47<>\"\",AQ8:AQ47)))","v":""},{"$f":"IF(COUNT(AR8:AR47)=0,\"\",_xlfn.STDEV.S(IF(AR8:AR47<>\"\",AR8:AR47)))","v":""},{"$f":"IF(COUNT(AS8:AS47)=0,\"\",_xlfn.STDEV.S(IF(AS8:AS47<>\"\",AS8:AS47)))","v":""},{"$f":"IF(COUNT(AT8:AT47)=0,\"\",_xlfn.STDEV.S(IF(AT8:AT47<>\"\",AT8:AT47)))","v":""},{"$f":"IF(COUNT(AU8:AU47)=0,\"\",_xlfn.STDEV.S(IF(AU8:AU47<>\"\",AU8:AU47)))","v":""},{"$f":"IF(COUNT(AV8:AV47)=0,\"\",_xlfn.STDEV.S(IF(AV8:AV47<>\"\",AV8:AV47)))","v":""},{"$f":"IF(COUNT(AW8:AW47)=0,\"\",_xlfn.STDEV.S(IF(AW8:AW47<>\"\",AW8:AW47)))","v":""},{"$f":"IF(COUNT(AX8:AX47)=0,\"\",_xlfn.STDEV.S(IF(AX8:AX47<>\"\",AX8:AX47)))","v":""},{"$f":"IF(COUNT(AY8:AY47)=0,\"\",_xlfn.STDEV.S(IF(AY8:AY47<>\"\",AY8:AY47)))","v":""},{"$f":"IF(COUNT(AZ8:AZ47)=0,\"\",_xlfn.STDEV.S(IF(AZ8:AZ47<>\"\",AZ8:AZ47)))","v":""},{"$f":"IF(COUNT(BA8:BA47)=0,\"\",_xlfn.STDEV.S(IF(BA8:BA47<>\"\",BA8:BA47)))","v":""}]
[null,null,"Tingkat Kesukaran",{"$f":"JAWABAN_PG!D92","v":0},{"$f":"JAWABAN_PG!E92","v":0.52173913043478259},{"$f":"JAWABAN_PG!F92","v":0.60869565217391308},{"$f":"JAWABAN_PG!G92","v":0.21739130434782608},{"$f":"JAWABAN_PG!H92","v":0.95652173913043481},{"$f":"JAWABAN_PG!I92","v":0.95652173913043481},{"$f":"JAWABAN_PG!J92","v":0.91304347826086951},{"$f":"JAWABAN_PG!K92","v":0.47826086956521741},{"$f":"JAWABAN_PG!L92","v":0},{"$f":"JAWABAN_PG!M92","v":0.52173913043478259},{"$f":"JAWABAN_PG!N92","v":0.73913043478260865},{"$f":"JAWABAN_PG!O92","v":0},{"$f":"JAWABAN_PG!P92","v":0.95652173913043481},{"$f":"JAWABAN_PG!Q92","v":0.91304347826086951},{"$f":"JAWABAN_PG!R92","v":0.39130434782608697},{"$f":"JAWABAN_PG!S92","v":0.30434782608695654},{"$f":"JAWABAN_PG!T92","v":0.13043478260869565},{"$f":"JAWABAN_PG!U92","v":0.86956521739130432},{"$f":"JAWABAN_PG!V92","v":0.91304347826086951},{"$f":"JAWABAN_PG!W92","v":0.95652173913043481},{"$f":"JAWABAN_PG!X92","v":""},{"$f":"JAWABAN_PG!Y92","v":""},{"$f":"JAWABAN_PG!Z92","v":""},{"$f":"JAWABAN_PG!AA92","v":""},{"$f":"JAWABAN_PG!AB92","v":""},{"$f":"JAWABAN_PG!AC92","v":""},{"$f":"JAWABAN_PG!AD92","v":""},{"$f":"JAWABAN_PG!AE92","v":""},{"$f":"JAWABAN_PG!AF92","v":""},{"$f":"JAWABAN_PG!AG92","v":""},{"$f":"JAWABAN_PG!AH92","v":""},{"$f":"JAWABAN_PG!AI92","v":""},{"$f":"JAWABAN_PG!AJ92","v":""},{"$f":"JAWABAN_PG!AK92","v":""},{"$f":"JAWABAN_PG!AL92","v":""},{"$f":"JAWABAN_PG!AM92","v":""},{"$f":"JAWABAN_PG!AN92","v":""},{"$f":"JAWABAN_PG!AO92","v":""},{"$f":"JAWABAN_PG!AP92","v":""},{"$f":"JAWABAN_PG!AQ92","v":""},{"$f":"JAWABAN_PG!AR92","v":""},{"$f":"JAWABAN_PG!AS92","v":""},{"$f":"JAWABAN_PG!AT92","v":""},{"$f":"JAWABAN_PG!AU92","v":""},{"$f":"JAWABAN_PG!AV92","v":""},{"$f":"JAWABAN_PG!AW92","v":""},{"$f":"JAWABAN_PG!AX92","v":""},{"$f":"JAWABAN_PG!AY92","v":""},{"$f":"JAWABAN_PG!AZ92","v":""},{"$f":"JAWABAN_PG!BA92","v":""}]
[null,null,"Daya Beda",{"$f":"JAWABAN_PG!D93","v":0},{"$f":"JAWABAN_PG!E93","v":2},{"$f":"JAWABAN_PG!F93","v":2.3333333333333335},{"$f":"JAWABAN_PG!G93","v":0.83333333333333337},{"$f":"JAWABAN_PG!H93","v":0},{"$f":"JAWABAN_PG!I93","v":0},{"$f":"JAWABAN_PG!J93","v":0},{"$f":"JAWABAN_PG!K93","v":1.8333333333333333},{"$f":"JAWABAN_PG!L93","v":0},{"$f":"JAWABAN_PG!M93","v":2},{"$f":"JAWABAN_PG!N93","v":2.8333333333333335},{"$f":"JAWABAN_PG!O93","v":0},{"$f":"JAWABAN_PG!P93","v":0},{"$f":"JAWABAN_PG!Q93","v":0},{"$f":"JAWABAN_PG!R93","v":1.5},{"$f":"JAWABAN_PG!S93","v":1.1666666666666667},{"$f":"JAWABAN_PG!T93","v":0.5},{"$f":"JAWABAN_PG!U93","v":0},{"$f":"JAWABAN_PG!V93","v":0},{"$f":"JAWABAN_PG!W93","v":0},{"$f":"JAWABAN_PG!X93","v":""},{"$f":"JAWABAN_PG!Y93","v":""},{"$f":"JAWABAN_PG!Z93","v":""},{"$f":"JAWABAN_PG!AA93","v":""},{"$f":"JAWABAN_PG!AB93","v":""},{"$f":"JAWABAN_PG!AC93","v":""},{"$f":"JAWABAN_PG!AD93","v":""},{"$f":"JAWABAN_PG!AE93","v":""},{"$f":"JAWABAN_PG!AF93","v":""},{"$f":"JAWABAN_PG!AG93","v":""},{"$f":"JAWABAN_PG!AH93","v":""},{"$f":"JAWABAN_PG!AI93","v":""},{"$f":"JAWABAN_PG!AJ93","v":""},{"$f":"JAWABAN_PG!AK93","v":""},{"$f":"JAWABAN_PG!AL93","v":""},{"$f":"JAWABAN_PG!AM93","v":""},{"$f":"JAWABAN_PG!AN93","v":""},{"$f":"JAWABAN_PG!AO93","v":""},{"$f":"JAWABAN_PG!AP93","v":""},{"$f":"JAWABAN_PG!AQ93","v":""},{"$f":"JAWABAN_PG!AR93","v":""},{"$f":"JAWABAN_PG!AS93","v":""},{"$f":"JAWABAN_PG!AT93","v":""},{"$f":"JAWABAN_PG!AU93","v":""},{"$f":"JAWABAN_PG!AV93","v":""},{"$f":"JAWABAN_PG!AW93","v":""},{"$f":"JAWABAN_PG!AX93","v":""},{"$f":"JAWABAN_PG!AY93","v":""},{"$f":"JAWABAN_PG!AZ93","v":""},{"$f":"JAWABAN_PG!BA93","v":""}]
[]
[null,null,null,"Mengetahui,",null,null,null,null,null,null,null,null,null,null,null,null,null,null,null,null,null,null,null,null,null,null,null,null,null,null,null,null,null,null,null,null,null,{"$f":"DATA!G10","v":"Cikalong, 19 November 2025"}]
[null,null,null,"Kepala Madrasah",null,null,null,null,null,null,null,null,null,null,null,null,null,null,null,null,null,null,null,null,null,null,null,null,null,null,null,null,null,null,null,null,null,{"$f":"CONCATENATE(\"Guru\",\" \",DATA!G11)","v":"Guru Kimia"}]
[]
[]
[]
[]
[null,null,null,{"$f":"IF(DATA!G8=\"\",\"\",DATA!G8)","v":"Enjang, S.Ag., M.Pd.I."},null,null,null,null,null,null,null,null,null,null,null,null,null,null,null,null,null,null,null,null,null,null,null,null,null,null,null,null,null,null,null,null,null,{"$f":"IF(DATA!G6=\"\",\"\",DATA!G6)","v":"Arief Pribadi, S.Si."}]
[null,null,null,{"$f":"CONCATENATE(\"NIP.\",\" \",DATA!G9)","v":"NIP. 197406152005011006"},null,null,null,null,null,null,null,null,null,null,null,null,null,null,null,null,null,null,null,null,null,null,null,null,null,null,null,null,null,null,null,null,null,{"$f":"CONCATENATE(\"NIP.\",\" \",DATA!G7)","v":"NIP. 198603112020121005"}]

{"sheet":"TK_KESUKARAN_PG","index":3,"n_rows":92,"n_cols":4,"rows_kept":92,"cut":false,"hidden":false,"merged":[]}
[{"$f":"STATISTIK_PG!BC53","v":20}]
[{"$f":"STATISTIK_PG!BC53","v":20},"B. TINGKAT KESUKARAN SOAL PILIHAN GANDA"]
[]
[null,"Mata Pelajaran",{"$f":"CONCATENATE(\":\",\" \",DATA!G11)","v":": Kimia"}]
[null,"Kelas",{"$f":"CONCATENATE(\":\",\" \",DATA!G12)","v":": X-A"}]
[null,"Semester",{"$f":"CONCATENATE(\":\",\" \",DATA!G13)","v":": 1 (Ganjil)"}]
[null,"Tahun Pelajaran",{"$f":"CONCATENATE(\":\",\" \",DATA!G14)","v":": 2025/2026"}]
[]
[null,"NO SOAL","SKOR","TINGKAT KESUKARAN"]
[null,1,{"$f":"INDEX(STATISTIK_PG!$D$55:$BA$55, ROW(A1))","v":0},{"$f":"IF(C10<=0.3,\"Sukar\",IF(C10<=0.7,\"Sedang\",\"Mudah\"))","v":"Sukar"}]
[null,2,{"$f":"INDEX(STATISTIK_PG!$D$55:$BA$55, ROW(A2))","v":0.52173913043478259},{"$f":"IF(C11<=0.3,\"Sukar\",IF(C11<=0.7,\"Sedang\",\"Mudah\"))","v":"Sedang"}]
[null,3,{"$f":"INDEX(STATISTIK_PG!$D$55:$BA$55, ROW(A3))","v":0.60869565217391308},"Sedang"]
[null,4,{"$f":"INDEX(STATISTIK_PG!$D$55:$BA$55, ROW(A4))","v":0.21739130434782608},"Sukar"]
[null,5,{"$f":"INDEX(STATISTIK_PG!$D$55:$BA$55, ROW(A5))","v":0.95652173913043481},"Mudah"]
[null,6,{"$f":"INDEX(STATISTIK_PG!$D$55:$BA$55, ROW(A6))","v":0.95652173913043481},"Mudah"]
[null,7,{"$f":"INDEX(STATISTIK_PG!$D$55:$BA$55, ROW(A7))","v":0.91304347826086951},"Mudah"]
[null,8,{"$f":"INDEX(STATISTIK_PG!$D$55:$BA$55, ROW(A8))","v":0.47826086956521741},"Sedang"]
[null,9,{"$f":"INDEX(STATISTIK_PG!$D$55:$BA$55, ROW(A9))","v":0},"Sukar"]
[null,10,{"$f":"INDEX(STATISTIK_PG!$D$55:$BA$55, ROW(A10))","v":0.52173913043478259},"Sedang"]
[null,11,{"$f":"INDEX(STATISTIK_PG!$D$55:$BA$55, ROW(A11))","v":0.73913043478260865},"Mudah"]
[null,12,{"$f":"INDEX(STATISTIK_PG!$D$55:$BA$55, ROW(A12))","v":0},"Sukar"]
[null,13,{"$f":"INDEX(STATISTIK_PG!$D$55:$BA$55, ROW(A13))","v":0.95652173913043481},"Mudah"]
[null,14,{"$f":"INDEX(STATISTIK_PG!$D$55:$BA$55, ROW(A14))","v":0.91304347826086951},"Mudah"]
[null,15,{"$f":"INDEX(STATISTIK_PG!$D$55:$BA$55, ROW(A15))","v":0.39130434782608697},"Sedang"]
[null,16,{"$f":"INDEX(STATISTIK_PG!$D$55:$BA$55, ROW(A16))","v":0.30434782608695654},"Sedang"]
[null,17,{"$f":"INDEX(STATISTIK_PG!$D$55:$BA$55, ROW(A17))","v":0.13043478260869565},"Sukar"]
[null,18,{"$f":"INDEX(STATISTIK_PG!$D$55:$BA$55, ROW(A18))","v":0.86956521739130432},"Mudah"]
[null,19,{"$f":"INDEX(STATISTIK_PG!$D$55:$BA$55, ROW(A19))","v":0.91304347826086951},"Mudah"]
[null,20,{"$f":"INDEX(STATISTIK_PG!$D$55:$BA$55, ROW(A20))","v":0.95652173913043481},"Mudah"]
[null,21,{"$f":"INDEX(STATISTIK_PG!$D$55:$BA$55, ROW(A21))","v":""},"Mudah"]
[null,22,{"$f":"INDEX(STATISTIK_PG!$D$55:$BA$55, ROW(A22))","v":""},"Mudah"]
[null,23,{"$f":"INDEX(STATISTIK_PG!$D$55:$BA$55, ROW(A23))","v":""},"Mudah"]
[null,24,{"$f":"INDEX(STATISTIK_PG!$D$55:$BA$55, ROW(A24))","v":""},"Mudah"]
[null,25,{"$f":"INDEX(STATISTIK_PG!$D$55:$BA$55, ROW(A25))","v":""},"Mudah"]
[null,26,{"$f":"INDEX(STATISTIK_PG!$D$55:$BA$55, ROW(A26))","v":""},"Mudah"]
[null,27,{"$f":"INDEX(STATISTIK_PG!$D$55:$BA$55, ROW(A27))","v":""},"Mudah"]
[null,28,{"$f":"INDEX(STATISTIK_PG!$D$55:$BA$55, ROW(A28))","v":""},"Mudah"]
[null,29,{"$f":"INDEX(STATISTIK_PG!$D$55:$BA$55, ROW(A29))","v":""},"Mudah"]
[null,30,{"$f":"INDEX(STATISTIK_PG!$D$55:$BA$55, ROW(A30))","v":""},"Mudah"]
[null,31,{"$f":"INDEX(STATISTIK_PG!$D$55:$BA$55, ROW(A31))","v":""},"Mudah"]
[null,32,{"$f":"INDEX(STATISTIK_PG!$D$55:$BA$55, ROW(A32))","v":""},"Mudah"]
[null,33,{"$f":"INDEX(STATISTIK_PG!$D$55:$BA$55, ROW(A33))","v":""},"Mudah"]
[null,34,{"$f":"INDEX(STATISTIK_PG!$D$55:$BA$55, ROW(A34))","v":""},"Mudah"]
[null,35,{"$f":"INDEX(STATISTIK_PG!$D$55:$BA$55, ROW(A35))","v":""},"Mudah"]
[null,36,{"$f":"INDEX(STATISTIK_PG!$D$55:$BA$55, ROW(A36))","v":""},"Mudah"]
[null,37,{"$f":"INDEX(STATISTIK_PG!$D$55:$BA$55, ROW(A37))","v":""},"Mudah"]
[null,38,{"$f":"INDEX(STATISTIK_PG!$D$55:$BA$55, ROW(A38))","v":""},"Mudah"]
[null,39,{"$f":"INDEX(STATISTIK_PG!$D$55:$BA$55, ROW(A39))","v":""},"Mudah"]
[null,40,{"$f":"INDEX(STATISTIK_PG!$D$55:$BA$55, ROW(A40))","v":""},"Mudah"]
[null,41,{"$f":"INDEX(STATISTIK_PG!$D$55:$BA$55, ROW(A41))","v":""},"Mudah"]
[null,42,{"$f":"INDEX(STATISTIK_PG!$D$55:$BA$55, ROW(A42))","v":""},"Mudah"]
[null,43,{"$f":"INDEX(STATISTIK_PG!$D$55:$BA$55, ROW(A43))","v":""},"Mudah"]
[null,44,{"$f":"INDEX(STATISTIK_PG!$D$55:$BA$55, ROW(A44))","v":""},"Mudah"]
[null,45,{"$f":"INDEX(STATISTIK_PG!$D$55:$BA$55, ROW(A45))","v":""},"Mudah"]
[null,46,{"$f":"INDEX(STATISTIK_PG!$D$55:$BA$55, ROW(A46))","v":""},"Mudah"]
[null,47,{"$f":"INDEX(STATISTIK_PG!$D$55:$BA$55, ROW(A47))","v":""},"Mudah"]
[null,48,{"$f":"INDEX(STATISTIK_PG!$D$55:$BA$55, ROW(A48))","v":""},"Mudah"]
[null,49,{"$f":"INDEX(STATISTIK_PG!$D$55:$BA$55, ROW(A49))","v":""},"Mudah"]
[null,50,{"$f":"INDEX(STATISTIK_PG!$D$55:$BA$55, ROW(A50))","v":""},"Mudah"]
[]
[null,"Statistika Tingkat Kesukaran Pilihan Ganda"]
[null,"Tingkat","Jumlah","Persentase"]
[null,"Mudah",{"$f":"COUNTIF(D10:INDEX(D10:D59,$A$2),\"Mudah\")","v":9},{"$f":"C63/C66","v":0.45}]
[null,"Sedang",{"$f":"COUNTIF(D10:INDEX(D10:D59,$A$2),\"Sedang\")","v":6},{"$f":"C64/C66","v":0.3}]
[null,"Sukar",{"$f":"COUNTIF(D10:INDEX(D10:D59,$A$2),\"Sukar\")","v":5},{"$f":"C65/C66","v":0.25}]
[null,"Jumlah",{"$f":"SUM(C63:C65)","v":20},{"$f":"SUM(D63:D65)","v":1}]
[]
[]
[]
[]
[]
[]
[]
[]
[]
[]
[]
[]
[]
[]
[]
[]
[]
[]
[null,"Mengetahui,",null,{"$f":"DATA!G10","v":"Cikalong, 19 November 2025"}]
[null,"Kepala Madrasah",null,{"$f":"CONCATENATE(\"Guru\",\" \",DATA!G11)","v":"Guru Kimia"}]
[]
[]
[]
[]
[null,{"$f":"IF(DATA!G8=\"\",\"\",DATA!G8)","v":"Enjang, S.Ag., M.Pd.I."},null,{"$f":"IF(DATA!G6=\"\",\"\",DATA!G6)","v":"Arief Pribadi, S.Si."}]
[null,{"$f":"CONCATENATE(\"NIP.\",\" \",DATA!G9)","v":"NIP. 197406152005011006"},null,{"$f":"CONCATENATE(\"NIP.\",\" \",DATA!G7)","v":"NIP. 198603112020121005"}]

{"sheet":"DY_BEDA_PG","index":4,"n_rows":93,"n_cols":4,"rows_kept":93,"cut":false,"hidden":false,"merged":[]}
[{"$f":"TK_KESUKARAN_PG!A1","v":20}]
[{"$f":"STATISTIK_PG!BC53","v":20},"C. DAYA BEDA SOAL PILIHAN GANDA"]
[]
[null,"Mata Pelajaran",{"$f":"CONCATENATE(\":\",\" \",DATA!G11)","v":": Kimia"}]
[null,"Kelas",{"$f":"CONCATENATE(\":\",\" \",DATA!G12)","v":": X-A"}]
[null,"Semester",{"$f":"CONCATENATE(\":\",\" \",DATA!G13)","v":": 1 (Ganjil)"}]
[null,"Tahun Pelajaran",{"$f":"CONCATENATE(\":\",\" \",DATA!G14)","v":": 2025/2026"}]
[]
[null,"NO SOAL","SKOR","STATUS SOAL"]
[null,1,{"$f":"INDEX(STATISTIK_PG!$D$56:$BA$56, ROW(A1))","v":0},{"$f":"IF(C10<0.15,\"soal dibuang\",\n    IF(C10<0.2,\"soal diperbaiki\",\n        IF(C10<0.3,\"soal diterima tapi perlu perbaikan\",\n            \"soal diterima\"\n        )\n    )\n)","v":"soal dibuang"}]
[null,2,{"$f":"INDEX(STATISTIK_PG!$D$56:$BA$56, ROW(A2))","v":2},{"$f":"IF(C11<0.15,\"soal dibuang\",\n    IF(C11<0.2,\"soal diperbaiki\",\n        IF(C11<0.3,\"soal diterima tapi perlu perbaikan\",\n            \"soal diterima\"\n        )\n    )\n)","v":"soal diterima"}]
[null,3,{"$f":"INDEX(STATISTIK_PG!$D$56:$BA$56, ROW(A3))","v":2.3333333333333335},"soal diterima"]
[null,4,{"$f":"INDEX(STATISTIK_PG!$D$56:$BA$56, ROW(A4))","v":0.83333333333333337},"soal diterima"]
[null,5,{"$f":"INDEX(STATISTIK_PG!$D$56:$BA$56, ROW(A5))","v":0},"soal dibuang"]
[null,6,{"$f":"INDEX(STATISTIK_PG!$D$56:$BA$56, ROW(A6))","v":0},"soal dibuang"]
[null,7,{"$f":"INDEX(STATISTIK_PG!$D$56:$BA$56, ROW(A7))","v":0},"soal dibuang"]
[null,8,{"$f":"INDEX(STATISTIK_PG!$D$56:$BA$56, ROW(A8))","v":1.8333333333333333},"soal diterima"]
[null,9,{"$f":"INDEX(STATISTIK_PG!$D$56:$BA$56, ROW(A9))","v":0},"soal dibuang"]
[null,10,{"$f":"INDEX(STATISTIK_PG!$D$56:$BA$56, ROW(A10))","v":2},"soal diterima"]
[null,11,{"$f":"INDEX(STATISTIK_PG!$D$56:$BA$56, ROW(A11))","v":2.8333333333333335},"soal diterima"]
[null,12,{"$f":"INDEX(STATISTIK_PG!$D$56:$BA$56, ROW(A12))","v":0},"soal dibuang"]
[null,13,{"$f":"INDEX(STATISTIK_PG!$D$56:$BA$56, ROW(A13))","v":0},"soal dibuang"]
[null,14,{"$f":"INDEX(STATISTIK_PG!$D$56:$BA$56, ROW(A14))","v":0},"soal dibuang"]
[null,15,{"$f":"INDEX(STATISTIK_PG!$D$56:$BA$56, ROW(A15))","v":1.5},"soal diterima"]
[null,16,{"$f":"INDEX(STATISTIK_PG!$D$56:$BA$56, ROW(A16))","v":1.1666666666666667},"soal diterima"]
[null,17,{"$f":"INDEX(STATISTIK_PG!$D$56:$BA$56, ROW(A17))","v":0.5},"soal diterima"]
[null,18,{"$f":"INDEX(STATISTIK_PG!$D$56:$BA$56, ROW(A18))","v":0},"soal dibuang"]
[null,19,{"$f":"INDEX(STATISTIK_PG!$D$56:$BA$56, ROW(A19))","v":0},"soal dibuang"]
[null,20,{"$f":"INDEX(STATISTIK_PG!$D$56:$BA$56, ROW(A20))","v":0},"soal dibuang"]
[null,21,{"$f":"INDEX(STATISTIK_PG!$D$56:$BA$56, ROW(A21))","v":""},"soal diterima"]
[null,22,{"$f":"INDEX(STATISTIK_PG!$D$56:$BA$56, ROW(A22))","v":""},"soal diterima"]
[null,23,{"$f":"INDEX(STATISTIK_PG!$D$56:$BA$56, ROW(A23))","v":""},"soal diterima"]
[null,24,{"$f":"INDEX(STATISTIK_PG!$D$56:$BA$56, ROW(A24))","v":""},"soal diterima"]
[null,25,{"$f":"INDEX(STATISTIK_PG!$D$56:$BA$56, ROW(A25))","v":""},"soal diterima"]
[null,26,{"$f":"INDEX(STATISTIK_PG!$D$56:$BA$56, ROW(A26))","v":""},"soal diterima"]
[null,27,{"$f":"INDEX(STATISTIK_PG!$D$56:$BA$56, ROW(A27))","v":""},"soal diterima"]
[null,28,{"$f":"INDEX(STATISTIK_PG!$D$56:$BA$56, ROW(A28))","v":""},"soal diterima"]
[null,29,{"$f":"INDEX(STATISTIK_PG!$D$56:$BA$56, ROW(A29))","v":""},"soal diterima"]
[null,30,{"$f":"INDEX(STATISTIK_PG!$D$56:$BA$56, ROW(A30))","v":""},"soal diterima"]
[null,31,{"$f":"INDEX(STATISTIK_PG!$D$56:$BA$56, ROW(A31))","v":""},"soal diterima"]
[null,32,{"$f":"INDEX(STATISTIK_PG!$D$56:$BA$56, ROW(A32))","v":""},"soal diterima"]
[null,33,{"$f":"INDEX(STATISTIK_PG!$D$56:$BA$56, ROW(A33))","v":""},"soal diterima"]
[null,34,{"$f":"INDEX(STATISTIK_PG!$D$56:$BA$56, ROW(A34))","v":""},"soal diterima"]
[null,35,{"$f":"INDEX(STATISTIK_PG!$D$56:$BA$56, ROW(A35))","v":""},"soal diterima"]
[null,36,{"$f":"INDEX(STATISTIK_PG!$D$56:$BA$56, ROW(A36))","v":""},"soal diterima"]
[null,37,{"$f":"INDEX(STATISTIK_PG!$D$56:$BA$56, ROW(A37))","v":""},"soal diterima"]
[null,38,{"$f":"INDEX(STATISTIK_PG!$D$56:$BA$56, ROW(A38))","v":""},"soal diterima"]
[null,39,{"$f":"INDEX(STATISTIK_PG!$D$56:$BA$56, ROW(A39))","v":""},"soal diterima"]
[null,40,{"$f":"INDEX(STATISTIK_PG!$D$56:$BA$56, ROW(A40))","v":""},"soal diterima"]
[null,41,{"$f":"INDEX(STATISTIK_PG!$D$56:$BA$56, ROW(A41))","v":""},"soal diterima"]
[null,42,{"$f":"INDEX(STATISTIK_PG!$D$56:$BA$56, ROW(A42))","v":""},"soal diterima"]
[null,43,{"$f":"INDEX(STATISTIK_PG!$D$56:$BA$56, ROW(A43))","v":""},"soal diterima"]
[null,44,{"$f":"INDEX(STATISTIK_PG!$D$56:$BA$56, ROW(A44))","v":""},"soal diterima"]
[null,45,{"$f":"INDEX(STATISTIK_PG!$D$56:$BA$56, ROW(A45))","v":""},"soal diterima"]
[null,46,{"$f":"INDEX(STATISTIK_PG!$D$56:$BA$56, ROW(A46))","v":""},"soal diterima"]
[null,47,{"$f":"INDEX(STATISTIK_PG!$D$56:$BA$56, ROW(A47))","v":""},"soal diterima"]
[null,48,{"$f":"INDEX(STATISTIK_PG!$D$56:$BA$56, ROW(A48))","v":""},"soal diterima"]
[null,49,{"$f":"INDEX(STATISTIK_PG!$D$56:$BA$56, ROW(A49))","v":""},"soal diterima"]
[null,50,{"$f":"INDEX(STATISTIK_PG!$D$56:$BA$56, ROW(A50))","v":""},"soal diterima"]
[]
[null,"Statistik Daya Beda Soal Pilihan Ganda"]
[null,"Tingkat","Jumlah","Persentase"]
[null,"Soal dibuang",{"$f":"COUNTIF(D10:INDEX(D10:D59,$A$2),\"Soal dibuang\")","v":11},{"$f":"C63/C67","v":0.55000000000000004}]
[null,"Soal diperbaiki",{"$f":"COUNTIF(D10:INDEX(D10:D59,$A$2),\"Soal diperbaiki\")","v":0},{"$f":"C64/C67","v":0}]
[null,"Soal diterima tapi perlu perbaikan",{"$f":"COUNTIF(D10:INDEX(D10:D59,$A$2),\"Soal diterima tapi perlu perbaikan\")","v":0},{"$f":"C65/C67","v":0}]
[null,"Soal diterima",{"$f":"COUNTIF(D10:INDEX(D10:D59,$A$2),\"Soal diterima\")","v":9},{"$f":"C66/C67","v":0.45}]
[null,"Jumlah",{"$f":"SUM(C63:C66)","v":20},{"$f":"SUM(D63:D66)","v":1}]
[]
[]
[]
[]
[]
[]
[]
[]
[]
[]
[]
[]
[]
[]
[]
[]
[]
[]
[null,"Mengetahui,",null,{"$f":"DATA!G10","v":"Cikalong, 19 November 2025"}]
[null,"Kepala Madrasah",null,{"$f":"CONCATENATE(\"Guru\",\" \",DATA!G11)","v":"Guru Kimia"}]
[]
[]
[]
[]
[null,{"$f":"IF(DATA!G8=\"\",\"\",DATA!G8)","v":"Enjang, S.Ag., M.Pd.I."},null,{"$f":"IF(DATA!G6=\"\",\"\",DATA!G6)","v":"Arief Pribadi, S.Si."}]
[null,{"$f":"CONCATENATE(\"NIP.\",\" \",DATA!G9)","v":"NIP. 197406152005011006"},null,{"$f":"CONCATENATE(\"NIP.\",\" \",DATA!G7)","v":"NIP. 198603112020121005"}]

{"sheet":"DH_REMEDIAL_PG","index":5,"n_rows":58,"n_cols":7,"rows_kept":58,"cut":false,"hidden":false,"merged":[[8,5,8,6]]}
[{"$f":"TK_KESUKARAN_PG!A1","v":20}]
[{"$f":"STATISTIK_PG!BC53","v":20},"D. DAFTAR HADIR REMEDIAL (PILIHAN GANDA)"]
[]
[null,"Mata Pelajaran",{"$f":"CONCATENATE(\":\",\" \",DATA!G11)","v":": Kimia"}]
[null,"Kelas",{"$f":"CONCATENATE(\":\",\" \",DATA!G12)","v":": X-A"}]
[null,"Semester",{"$f":"CONCATENATE(\":\",\" \",DATA!G13)","v":": 1 (Ganjil)"}]
[null,"Tahun Pelajaran",{"$f":"CONCATENATE(\":\",\" \",DATA!G14)","v":": 2025/2026"}]
[]
[null,"NO","NISN","NAMA","NO SOAL BELUM TUNTAS","TANDA TANGAN"]
[null,1,{"$f":"IF(VALUE(DATA!B6)=0, \"\", TEXT(VALUE(DATA!B6), REPT(\"0\", LEN(DATA!B6))))","v":"0104009164"},{"$f":"IF(DATA!C6=\"\",\"\",DATA!C6)","v":"AGUS FIRMAN SYABANI"},{"$f":"JAWABAN_PG!BB50","v":"1; 4; 9; 12; 16; 17"},1]
[null,2,{"$f":"IF(VALUE(DATA!B7)=0, \"\", TEXT(VALUE(DATA!B7), REPT(\"0\", LEN(DATA!B7))))","v":"0096257187"},{"$f":"IF(DATA!C7=\"\",\"\",DATA!C7)","v":"Aisyah"},{"$f":"JAWABAN_PG!BB51","v":"1; 2; 9; 10; 11; 12; 16; 17"},null,2]
[null,3,{"$f":"IF(VALUE(DATA!B8)=0, \"\", TEXT(VALUE(DATA!B8), REPT(\"0\", LEN(DATA!B8))))","v":"0099072726"},{"$f":"IF(DATA!C8=\"\",\"\",DATA!C8)","v":"AMELIA CARISA PUTRI"},{"$f":"JAWABAN_PG!BB52","v":"1; 8; 9; 10; 12; 17"},3]
[null,4,{"$f":"IF(VALUE(DATA!B9)=0, \"\", TEXT(VALUE(DATA!B9), REPT(\"0\", LEN(DATA!B9))))","v":"3097509262"},{"$f":"IF(DATA!C9=\"\",\"\",DATA!C9)","v":"APINA INTAN AULIA"},{"$f":"JAWABAN_PG!BB53","v":"1; 2; 9; 10; 11; 12; 16; 17"},null,4]
[null,5,{"$f":"IF(VALUE(DATA!B10)=0, \"\", TEXT(VALUE(DATA!B10), REPT(\"0\", LEN(DATA!B10))))","v":"0096438158"},{"$f":"IF(DATA!C10=\"\",\"\",DATA!C10)","v":"ARIA TIRTA ANGGARA"},{"$f":"JAWABAN_PG!BB54","v":""},5]
[null,5,{"$f":"IF(VALUE(DATA!B11)=0, \"\", TEXT(VALUE(DATA!B11), REPT(\"0\", LEN(DATA!B11))))","v":"0081324455"},{"$f":"IF(DATA!C11=\"\",\"\",DATA!C11)","v":"BAGAS DWI PUTRA"},{"$f":"JAWABAN_PG!BB55","v":"1; 2; 3; 4; 9; 12"},5]
[null,6,{"$f":"IF(VALUE(DATA!B12)=0, \"\", TEXT(VALUE(DATA!B12), REPT(\"0\", LEN(DATA!B12))))","v":"0105997732"},{"$f":"IF(DATA!C12=\"\",\"\",DATA!C12)","v":"DEA LESTARI"},{"$f":"JAWABAN_PG!BB56","v":"1; 2; 3; 8; 9; 10; 11; 12; 15; 16; 17"},null,6]
[null,7,{"$f":"IF(VALUE(DATA!B13)=0, \"\", TEXT(VALUE(DATA!B13), REPT(\"0\", LEN(DATA!B13))))","v":"0097769415"},{"$f":"IF(DATA!C13=\"\",\"\",DATA!C13)","v":"DEIS SANCI"},{"$f":"JAWABAN_PG!BB57","v":"1; 3; 4; 9; 11; 12; 16; 17"},7]
[null,8,{"$f":"IF(VALUE(DATA!B14)=0, \"\", TEXT(VALUE(DATA!B14), REPT(\"0\", LEN(DATA!B14))))","v":"0073609592"},{"$f":"IF(DATA!C14=\"\",\"\",DATA!C14)","v":"DIANA MARWAH"},{"$f":"JAWABAN_PG!BB58","v":"1; 4; 8; 9; 10; 12; 17"},null,8]
[null,9,{"$f":"IF(VALUE(DATA!B15)=0, \"\", TEXT(VALUE(DATA!B15), REPT(\"0\", LEN(DATA!B15))))","v":"0093260667"},{"$f":"IF(DATA!C15=\"\",\"\",DATA!C15)","v":"ELEN PUSPITA SARI"},{"$f":"JAWABAN_PG!BB59","v":"1; 9; 12; 15; 17"},9]
[null,10,{"$f":"IF(VALUE(DATA!B16)=0, \"\", TEXT(VALUE(DATA!B16), REPT(\"0\", LEN(DATA!B16))))","v":"3094067902"},{"$f":"IF(DATA!C16=\"\",\"\",DATA!C16)","v":"FEBRIAN MUHAMAD YAHPA"},{"$f":"JAWABAN_PG!BB60","v":"1; 2; 3; 4; 9; 11; 12; 14; 15; 16; 17; 18; 19"},null,10]
[null,11,{"$f":"IF(VALUE(DATA!B17)=0, \"\", TEXT(VALUE(DATA!B17), REPT(\"0\", LEN(DATA!B17))))","v":"03090982486"},{"$f":"IF(DATA!C17=\"\",\"\",DATA!C17)","v":"HIKMAL ANGGIA PRATAMA"},{"$f":"JAWABAN_PG!BB61","v":"1; 4; 7; 9; 12; 15; 16; 17"},11]
[null,12,{"$f":"IF(VALUE(DATA!B18)=0, \"\", TEXT(VALUE(DATA!B18), REPT(\"0\", LEN(DATA!B18))))","v":"0098360161"},{"$f":"IF(DATA!C18=\"\",\"\",DATA!C18)","v":"IKHSAN FAUZI JULIANA"},{"$f":"JAWABAN_PG!BB62","v":"1; 2; 3; 4; 9; 10; 12; 15; 16; 17"},null,12]
[null,13,{"$f":"IF(VALUE(DATA!B19)=0, \"\", TEXT(VALUE(DATA!B19), REPT(\"0\", LEN(DATA!B19))))","v":"0092391673"},{"$f":"IF(DATA!C19=\"\",\"\",DATA!C19)","v":"INDRI"},{"$f":"JAWABAN_PG!BB63","v":"1; 4; 9; 12; 15; 16; 17; 18"},13]
[null,14,{"$f":"IF(VALUE(DATA!B20)=0, \"\", TEXT(VALUE(DATA!B20), REPT(\"0\", LEN(DATA!B20))))","v":"0097558410"},{"$f":"IF(DATA!C20=\"\",\"\",DATA!C20)","v":"IRSAN EFENDI"},{"$f":"JAWABAN_PG!BB64","v":"1; 4; 8; 9; 10; 12; 15; 16; 17"},null,14]
[null,15,{"$f":"IF(VALUE(DATA!B21)=0, \"\", TEXT(VALUE(DATA!B21), REPT(\"0\", LEN(DATA!B21))))","v":"0107569281"},{"$f":"IF(DATA!C21=\"\",\"\",DATA!C21)","v":"MAYANG SRI WULAN"},{"$f":"JAWABAN_PG!BB65","v":"1; 4; 8; 9; 10; 12; 15; 16; 17"},15]
[null,16,{"$f":"IF(VALUE(DATA!B22)=0, \"\", TEXT(VALUE(DATA!B22), REPT(\"0\", LEN(DATA!B22))))","v":"0093343105"},{"$f":"IF(DATA!C22=\"\",\"\",DATA!C22)","v":"NEYLLA AGUSTIN"},{"$f":"JAWABAN_PG!BB66","v":"1; 4; 8; 9; 12; 17"},null,16]
[null,17,{"$f":"IF(VALUE(DATA!B23)=0, \"\", TEXT(VALUE(DATA!B23), REPT(\"0\", LEN(DATA!B23))))","v":"3094158453"},{"$f":"IF(DATA!C23=\"\",\"\",DATA!C23)","v":"NURAENI"},{"$f":"JAWABAN_PG!BB67","v":"1; 2; 3; 4; 8; 9; 12; 15; 16; 17"},17]
[null,18,{"$f":"IF(VALUE(DATA!B24)=0, \"\", TEXT(VALUE(DATA!B24), REPT(\"0\", LEN(DATA!B24))))","v":"3095543410"},{"$f":"IF(DATA!C24=\"\",\"\",DATA!C24)","v":"NURI NURFATMAH"},{"$f":"JAWABAN_PG!BB68","v":"1; 2; 3; 4; 8; 9; 12; 15; 16; 17"},null,18]
[null,19,{"$f":"IF(VALUE(DATA!B25)=0, \"\", TEXT(VALUE(DATA!B25), REPT(\"0\", LEN(DATA!B25))))","v":"0094561223"},{"$f":"IF(DATA!C25=\"\",\"\",DATA!C25)","v":"PIKA AYU AMBARWATI"},{"$f":"JAWABAN_PG!BB69","v":"1; 2; 3; 4; 8; 9; 10; 12; 15; 16; 17"},19]
[null,20,{"$f":"IF(VALUE(DATA!B26)=0, \"\", TEXT(VALUE(DATA!B26), REPT(\"0\", LEN(DATA!B26))))","v":"0106627089"},{"$f":"IF(DATA!C26=\"\",\"\",DATA!C26)","v":"PUPUT DILA NOPITA SARI"},{"$f":"JAWABAN_PG!BB70","v":"1; 4; 9; 12"},null,20]
[null,21,{"$f":"IF(VALUE(DATA!B27)=0, \"\", TEXT(VALUE(DATA!B27), REPT(\"0\", LEN(DATA!B27))))","v":"0096736537"},{"$f":"IF(DATA!C27=\"\",\"\",DATA!C27)","v":"RAYHAN NUR RAMDANI"},{"$f":"JAWABAN_PG!BB71","v":"1; 4; 8; 9; 12; 15; 16; 17"},21]
[null,22,{"$f":"IF(VALUE(DATA!B28)=0, \"\", TEXT(VALUE(DATA!B28), REPT(\"0\", LEN(DATA!B28))))","v":"0093056273"},{"$f":"IF(DATA!C28=\"\",\"\",DATA!C28)","v":"VINI NUR AVIANI"},{"$f":"JAWABAN_PG!BB72","v":"1; 2; 3; 4; 8; 9; 10; 12; 15"},null,22]
[null,23,{"$f":"IF(VALUE(DATA!B29)=0, \"\", TEXT(VALUE(DATA!B29), REPT(\"0\", LEN(DATA!B29))))","v":"0099416925"},{"$f":"IF(DATA!C29=\"\",\"\",DATA!C29)","v":"YULIA SITI QOYIMAH"},{"$f":"JAWABAN_PG!BB73","v":"1; 2; 4; 5; 6; 7; 8; 9; 10; 11; 12; 13; 14; 15; 16; 17; 18; 19; 20"},23]
[null,25,{"$f":"IF(VALUE(DATA!B30)=0, \"\", TEXT(VALUE(DATA!B30), REPT(\"0\", LEN(DATA!B30))))","v":""},{"$f":"IF(DATA!C30=\"\",\"\",DATA!C30)","v":""},{"$f":"JAWABAN_PG!BB74","v":""},25]
[null,26,{"$f":"IF(VALUE(DATA!B31)=0, \"\", TEXT(VALUE(DATA!B31), REPT(\"0\", LEN(DATA!B31))))","v":""},{"$f":"IF(DATA!C31=\"\",\"\",DATA!C31)","v":""},{"$f":"JAWABAN_PG!BB75","v":""},null,26]
[null,27,{"$f":"IF(VALUE(DATA!B32)=0, \"\", TEXT(VALUE(DATA!B32), REPT(\"0\", LEN(DATA!B32))))","v":""},{"$f":"IF(DATA!C32=\"\",\"\",DATA!C32)","v":""},{"$f":"JAWABAN_PG!BB76","v":""},27]
[null,28,{"$f":"IF(VALUE(DATA!B33)=0, \"\", TEXT(VALUE(DATA!B33), REPT(\"0\", LEN(DATA!B33))))","v":""},{"$f":"IF(DATA!C33=\"\",\"\",DATA!C33)","v":""},{"$f":"JAWABAN_PG!BB77","v":""},null,28]
[null,29,{"$f":"IF(VALUE(DATA!B34)=0, \"\", TEXT(VALUE(DATA!B34), REPT(\"0\", LEN(DATA!B34))))","v":""},{"$f":"IF(DATA!C34=\"\",\"\",DATA!C34)","v":""},{"$f":"JAWABAN_PG!BB78","v":""},29]
[null,30,{"$f":"IF(VALUE(DATA!B35)=0, \"\", TEXT(VALUE(DATA!B35), REPT(\"0\", LEN(DATA!B35))))","v":""},{"$f":"IF(DATA!C35=\"\",\"\",DATA!C35)","v":""},{"$f":"JAWABAN_PG!BB79","v":""},null,30]
[null,31,{"$f":"IF(VALUE(DATA!B36)=0, \"\", TEXT(VALUE(DATA!B36), REPT(\"0\", LEN(DATA!B36))))","v":""},{"$f":"IF(DATA!C36=\"\",\"\",DATA!C36)","v":""},{"$f":"JAWABAN_PG!BB80","v":""},31]
[null,32,{"$f":"IF(VALUE(DATA!B37)=0, \"\", TEXT(VALUE(DATA!B37), REPT(\"0\", LEN(DATA!B37))))","v":""},{"$f":"IF(DATA!C37=\"\",\"\",DATA!C37)","v":""},{"$f":"JAWABAN_PG!BB81","v":""},null,32]
[null,33,{"$f":"IF(VALUE(DATA!B38)=0, \"\", TEXT(VALUE(DATA!B38), REPT(\"0\", LEN(DATA!B38))))","v":""},{"$f":"IF(DATA!C38=\"\",\"\",DATA!C38)","v":""},{"$f":"JAWABAN_PG!BB82","v":""},33]
[null,34,{"$f":"IF(VALUE(DATA!B39)=0, \"\", TEXT(VALUE(DATA!B39), REPT(\"0\", LEN(DATA!B39))))","v":""},{"$f":"IF(DATA!C39=\"\",\"\",DATA!C39)","v":""},{"$f":"JAWABAN_PG!BB83","v":""},null,34]
[null,35,{"$f":"IF(VALUE(DATA!B40)=0, \"\", TEXT(VALUE(DATA!B40), REPT(\"0\", LEN(DATA!B40))))","v":""},{"$f":"IF(DATA!C40=\"\",\"\",DATA!C40)","v":""},{"$f":"JAWABAN_PG!BB84","v":""},35]
[null,36,{"$f":"IF(VALUE(DATA!B41)=0, \"\", TEXT(VALUE(DATA!B41), REPT(\"0\", LEN(DATA!B41))))","v":""},{"$f":"IF(DATA!C41=\"\",\"\",DATA!C41)","v":""},{"$f":"JAWABAN_PG!BB85","v":""},null,36]
[null,37,{"$f":"IF(VALUE(DATA!B42)=0, \"\", TEXT(VALUE(DATA!B42), REPT(\"0\", LEN(DATA!B42))))","v":""},{"$f":"IF(DATA!C42=\"\",\"\",DATA!C42)","v":""},{"$f":"JAWABAN_PG!BB86","v":""},37]
[null,38,{"$f":"IF(VALUE(DATA!B43)=0, \"\", TEXT(VALUE(DATA!B43), REPT(\"0\", LEN(DATA!B43))))","v":""},{"$f":"IF(DATA!C43=\"\",\"\",DATA!C43)","v":""},{"$f":"JAWABAN_PG!BB87","v":""},null,38]
[null,39,{"$f":"IF(VALUE(DATA!B44)=0, \"\", TEXT(VALUE(DATA!B44), REPT(\"0\", LEN(DATA!B44))))","v":""},{"$f":"IF(DATA!C44=\"\",\"\",DATA!C44)","v":""},{"$f":"JAWABAN_PG!BB88","v":""},39]
[null,40,{"$f":"IF(VALUE(DATA!B45)=0, \"\", TEXT(VALUE(DATA!B45), REPT(\"0\", LEN(DATA!B45))))","v":""},{"$f":"IF(DATA!C45=\"\",\"\",DATA!C45)","v":""},{"$f":"JAWABAN_PG!BB89","v":""},null,40]
[]
[null,null,"Mengetahui,",null,null,{"$f":"DATA!G10","v":"Cikalong, 19 November 2025"}]
[null,null,"Kepala Madrasah",null,null,{"$f":"CONCATENATE(\"Guru\",\" \",DATA!G11)","v":"Guru Kimia"}]
[]
[]
[]
[]
[null,null,{"$f":"IF(DATA!G8=\"\",\"\",DATA!G8)","v":"Enjang, S.Ag., M.Pd.I."},null,null,{"$f":"IF(DATA!G6=\"\",\"\",DATA!G6)","v":"Arief Pribadi, S.Si."}]
[null,null,{"$f":"CONCATENATE(\"NIP.\",\" \",DATA!G9)","v":"NIP. 197406152005011006"},null,null,{"$f":"CONCATENATE(\"NIP.\",\" \",DATA!G7)","v":"NIP. 198603112020121005"}]

{"sheet":"COVER_PG","index":6,"n_rows":51,"n_cols":6,"rows_kept":51,"cut":false,"hidden":false,"merged":[[47,0,47,8],[48,0,48,8],[49,0,49,8],[50,0,50,8],[13,5,15,7],[36,0,36,8],[37,0,37,8],[38,0,38,8],[46,0,46,8],[11,5,11,7],[1,0,1,8],[2,0,2,8],[8,5,8,7],[9,5,9,7],[10,5,10,7]]}
[]
["ANALISIS BUTIR SOAL PILIHAN GANDA"]
[{"$f":"DATA!G16","v":"Asesmen Sumatif Akhir Semester"}]
[]
[]
[]
[]
[]
[null,"Mata Pelajaran",null,null,":",{"$f":"DATA!G11","v":"Kimia"}]
[null,"Kelas",null,null,":",{"$f":"DATA!G12","v":"X-A"}]
[null,"Semester",null,null,":",{"$f":"DATA!G13","v":"1 (Ganjil)"}]
[null,"Tahun Pelajaran",null,null,":",{"$f":"DATA!G14","v":"2025/2026"}]
[null,"Jenis Penilaian",null,null,":",{"$f":"DATA!G16","v":"Asesmen Sumatif Akhir Semester"}]
[null,"Tujuan Pembelajaran (TP)",null,null,":",{"$f":"DATA!G20","v":"asesmen sumatif akhir semester ganjil"}]
[]
[]
[]
[]
[]
[]
[]
[]
[]
[]
[]
[]
[]
[]
[]
[]
[]
[]
[]
[]
[]
[]
["Oleh :"]
[{"$f":"DATA!G6","v":"Arief Pribadi, S.Si."}]
[{"$f":"CONCATENATE(\"NIP.\",\" \",DATA!G7)","v":"NIP. 198603112020121005"}]
[]
[]
[]
[]
[]
[]
[]
["KEMENTERIAN AGAMA REPUBLIK INDONESIA"]
["KANTOR KEMENTERIAN AGAMA KABUPATEN TASIKMALAYA"]
[{"$f":"DATA!A3","v":"MAN 4 Tasikmalaya"}]
[{"$f":"DATA!A4","v":"Jalan Sindanghurip Ds. Cikalong Kec. Cikalong Kab. Tasikmalaya 46195"}]
[{"$f":"DATA!G14","v":"2025/2026"}]