{"text_format":"1","workbook":"xlsx","n_sheets":7,"sheets":["DATA","JAWABAN_PG","STATISTIK_PG","TK_KESUKARAN_PG","DY_BEDA_PG","DH_REMEDIAL_PG","COVER_PG"],"not_rendered":{"charts":2,"images":2,"macros":1,"external_links":0,"defined_names":5,"comments":0,"pivot_tables":0},"unopened":[],"bounds":{"document_bytes":16777216,"sheet_cells":100000,"rows_first":2000,"rows_last":500,"rows_between":2000,"halvings":0,"cell_chars":16384,"cell_head_chars":4096},"cells_cut":0,"cells_raw":0,"read":"whole","date_system":"1900"}

{"sheet":"DATA","index":0,"n_rows":45,"n_cols":13,"rows_kept":45,"cut":false,"hidden":false,"merged":[[19,6,21,6],[0,4,3,4],[0,5,3,6],[0,0,0,2],[1,0,1,2],[2,0,2,2],[3,0,3,2],[19,4,21,4],[19,5,21,5]]}
["KEMENTERIAN AGAMA REPUBLIK INDONESIA",null,null,null,null,"APLIKASI ANALISIS BUTIR SOAL"]
["KANTOR KEMENTERIAN AGAMA KABUPATEN TASIKMALAYA"]
[{"$f":"G5","v":"MAN 4 Tasikmalaya"}]
["Jalan Sindanghurip Ds. Cikalong Kec. Cikalong Kab. Tasikmalaya 46195"]
["NO","NISN","NAMA",null,"Nama Sekolah",":","MAN 4 Tasikmalaya",null,"Qur'an Hadis","X-A","1 (Ganjil)","2025/2026","Asesmen Sumatif Harian"]
[1,"0104009164","AGUS FIRMAN SYABANI",null,"Nama Guru",":","Arief Pribadi, S.Si.",null,"Akidah Akhlak","X-B","2 (Genap)","2026/2027","Asesmen Sumatif Akhir Semester"]
[2,"0096257187","Aisyah",null,"NIP",":","198603112020121005",null,"Fikih","X-C",null,"2027/2028","Asesmen Susmatif Akhir Tahun"]
[3,"0099072726","AMELIA CARISA PUTRI",null,"Nama Kepala Sekolah",":","Enjang, S.Ag., M.Pd.I.",null,"SKI","X-D",null,"2028/2029"]
[4,"3097509262","APINA INTAN AULIA",null,"NIP",":","197406152005011006",null,"Bahasa Arab","X-E",null,"2029/2030"]
[5,"0096438158","ARIA TIRTA ANGGARA",null,"Pelaksanaan Asesmen",":","Cikalong, 19 November 2025",null,"PKN","X-F"]
{"$rows_left_out":36}
{"sheet":"JAWABAN_PG","index":1,"n_rows":136,"n_cols":54,"rows_kept":136,"cut":false,"hidden":false,"merged":[[4,3,4,52],[4,0,7,0],[4,1,7,1]]}
[{"$f":"ROUND(DATA!G23*0.27,0)","v":6}]
[]
[]
[]
["NO","NISN","NAMA","DISTRIBUSI JAWABAN SISWA"]
[null,null,"SKOR JAWABAN",5,5,5,5,5,5,5,5,5,5,5,5,5,5,5,5,5,5,5,5]
[null,null,"NOMOR SOAL",1,2,3,4,5,6,7,8,9,10,11,12,13,14,15,16,17,18,19,20,21,22,23,24,25,26,27,28,29,30,31,32,33,34,35,36,37,38,39,40,41,42,43,44,45,46,47,48,49,50]
[null,null,"KUNCI JAWABAN","Sebagian besar volume atom adalah ruang kosong, Partikel alfa bermuatan positif, Inti atom bermuatan positif","kedua ion memiliki jumlah elektron yang sama","Salah",42,36,80,"35.5",74,"Lihat gambar, Jumlah elektron valensi atom X adalah 4, Konfigurasi elektron atom X menurut Mekanika Kuantum adalah 1s2 2s2 2p6 3s2 3p2","Salah",8,"d",2,33,"n= 3, l= 1, m= +1, s= - ½","Salah","Bilangan kuantum spin elektron terakhir adalah – ½, Bilangan kuantum magnetik elektron terakhir adalah 0, Bilangan kuantum utama elektron terakhir adalah 3",50,35,29,null,null,null,null,null,null,null,null,null,null,null,null,null,null,null,null,null,null,null,null,null,null,null,null,null,null,null,null,null,null,{"$f":"COUNTA(D8:BA8)","v":20}]
[1,{"$f":"IF(VALUE(DATA!B6)=0, \"\", TEXT(VALUE(DATA!B6), REPT(\"0\", LEN(DATA!B6))))","v":"0104009164"},{"$f":"IF(DATA!C6=\"\",\"\",DATA!C6)","v":"AGUS FIRMAN SYABANI"},"Sebagian besar volume atom adalah ruang kosong, Inti atom memiliki ukuran relatif sangat kecil, Partikel alfa bermuatan positif, Inti atom bermuatan positif","kedua ion memiliki jumlah elektron yang sama","Salah",52,36,80,"35.5",74,"Lihat gambar","Salah",8,"d ",2,33,"n= 3, l= 1, m= +1, s= - ½","Benar","Bilangan kuantum spin elektron terakhir adalah – ½, Bilangan kuantum magnetik elektron terakhir adalah 0, Bilangan kuantum azimuth elektron terakhir adalah 2, Bilangan kuantum utama elektron terakhir adalah 3",50,35,29]
[2,{"$f":"IF(VALUE(DATA!B7)=0, \"\", TEXT(VALUE(DATA!B7), REPT(\"0\", LEN(DATA!B7))))","v":"0096257187"},{"$f":"IF(DATA!C7=\"\",\"\",DATA!C7)","v":"Aisyah"},"Inti atom bermuatan positif","jumlah elektron ion magnesium > ion oksida","Salah",42,36,80,"35.5",74,"Jumlah elektron valensi atom X adalah 4","Benar","8.","3d",2,33,"n= 3, l= 1, m= +1, s= - ½","Benar","Bilangan kuantum magnetik elektron terakhir adalah 0",50,35,29]
{"$rows_left_out":127}
{"sheet":"STATISTIK_PG","index":2,"n_rows":65,"n_cols":55,"rows_kept":65,"cut":false,"hidden":false,"merged":[[5,54,6,54],[5,3,5,52],[5,0,6,0],[5,1,6,1],[5,2,6,2],[5,53,6,53]]}
[]
[]
[]
[]
["A. DISTRIBUSI JAWABAN PILIHAN GANDA"]
["NO","NISN","NAMA","SKOR JAWABAN PER SOAL",null,null,null,null,null,null,null,null,null,null,null,null,null,null,null,null,null,null,null,null,null,null,null,null,null,null,null,null,null,null,null,null,null,null,null,null,null,null,null,null,null,null,null,null,null,null,null,null,null,"NILAI","T/BT"]
[null,null,null,1,2,3,4,5,6,7,8,9,10,11,12,13,14,15,16,17,18,19,20,21,22,23,24,25,26,27,28,29,30,31,32,33,34,35,36,37,38,39,40,41,42,43,44,45,46,47,48,49,50]
[1,{"$f":"IF(VALUE(DATA!B6)=0, \"\", TEXT(VALUE(DATA!B6), REPT(\"0\", LEN(DATA!B6))))","v":"0104009164"},{"$f":"IF(DATA!C6=\"\",\"\",DATA!C6)","v":"AGUS FIRMAN SYABANI"},{"$f":"JAWABAN_PG!D97","v":0},{"$f":"JAWABAN_PG!E97","v":5},{"$f":"JAWABAN_PG!F97","v":5},{"$f":"JAWABAN_PG!G97","v":0},{"$f":"JAWABAN_PG!H97","v":5},{"$f":"JAWABAN_PG!I97","v":5},{"$f":"JAWABAN_PG!J97","v":5},{"$f":"JAWABAN_PG!K97","v":5},{"$f":"JAWABAN_PG!L97","v":0},{"$f":"JAWABAN_PG!M97","v":5},{"$f":"JAWABAN_PG!N97","v":5},{"$f":"JAWABAN_PG!O97","v":0},{"$f":"JAWABAN_PG!P97","v":5},{"$f":"JAWABAN_PG!Q97","v":5},{"$f":"JAWABAN_PG!R97","v":5},{"$f":"JAWABAN_PG!S97","v":0},{"$f":"JAWABAN_PG!T97","v":0},{"$f":"JAWABAN_PG!U97","v":5},{"$f":"JAWABAN_PG!V97","v":5},{"$f":"JAWABAN_PG!W97","v":5},{"$f":"JAWABAN_PG!X97","v":""},{"$f":"JAWABAN_PG!Y97","v":""},{"$f":"JAWABAN_PG!Z97","v":""},{"$f":"JAWABAN_PG!AA97","v":""},{"$f":"JAWABAN_PG!AB97","v":""},{"$f":"JAWABAN_PG!AC97","v":""},{"$f":"JAWABAN_PG!AD97","v":""},{"$f":"JAWABAN_PG!AE97","v":""},{"$f":"JAWABAN_PG!AF97","v":""},{"$f":"JAWABAN_PG!AG97","v":""},{"$f":"JAWABAN_PG!AH97","v":""},{"$f":"JAWABAN_PG!AI97","v":""},{"$f":"JAWABAN_PG!AJ97","v":""},{"$f":"JAWABAN_PG!AK97","v":""},{"$f":"JAWABAN_PG!AL97","v":""},{"$f":"JAWABAN_PG!AM97","v":""},{"$f":"JAWABAN_PG!AN97","v":""},{"$f":"JAWABAN_PG!AO97","v":""},{"$f":"JAWABAN_PG!AP97","v":""},{"$f":"JAWABAN_PG!AQ97","v":""},{"$f":"JAWABAN_PG!AR97","v":""},{"$f":"JAWABAN_PG!AS97","v":""},{"$f":"JAWABAN_PG!AT97","v":""},{"$f":"JAWABAN_PG!AU97","v":""},{"$f":"JAWABAN_PG!AV97","v":""},{"$f":"JAWABAN_PG!AW97","v":""},{"$f":"JAWABAN_PG!AX97","v":""},{"$f":"JAWABAN_PG!AY97","v":""},{"$f":"JAWABAN_PG!AZ97","v":""},{"$f":"JAWABAN_PG!BA97","v":""},{"$f":"SUM(D8:BA8)","v":70},{"$f":"IF(BB8>=DATA!$G$15,\"TUNTAS\",\"BELUM TUNTAS\")","v":"BELUM TUNTAS"}]
[2,{"$f":"IF(VALUE(DATA!B7)=0, \"\", TEXT(VALUE(DATA!B7), REPT(\"0\", LEN(DATA!B7))))","v":"0096257187"},{"$f":"IF(DATA!C7=\"\",\"\",DATA!C7)","v":"Aisyah"},{"$f":"JAWABAN_PG!D98","v":0},{"$f":"JAWABAN_PG!E98","v":0},{"$f":"JAWABAN_PG!F98","v":5},{"$f":"JAWABAN_PG!G98","v":5},{"$f":"JAWABAN_PG!H98","v":5},{"$f":"JAWABAN_PG!I98","v":5},{"$f":"JAWABAN_PG!J98","v":5},{"$f":"JAWABAN_PG!K98","v":5},{"$f":"JAWABAN_PG!L98","v":0},{"$f":"JAWABAN_PG!M98","v":0},{"$f":"JAWABAN_PG!N98","v":0},{"$f":"JAWABAN_PG!O98","v":0},{"$f":"JAWABAN_PG!P98","v":5},{"$f":"JAWABAN_PG!Q98","v":5},{"$f":"JAWABAN_PG!R98","v":5},{"$f":"JAWABAN_PG!S98","v":0},{"$f":"JAWABAN_PG!T98","v":0},{"$f":"JAWABAN_PG!U98","v":5},{"$f":"JAWABAN_PG!V98","v":5},{"$f":"JAWABAN_PG!W98","v":5},{"$f":"JAWABAN_PG!X98","v":""},{"$f":"JAWABAN_PG!Y98","v":""},{"$f":"JAWABAN_PG!Z98","v":""},{"$f":"JAWABAN_PG!AA98","v":""},{"$f":"JAWABAN_PG!AB98","v":""},{"$f":"JAWABAN_PG!AC98","v":""},{"$f":"JAWABAN_PG!AD98","v":""},{"$f":"JAWABAN_PG!AE98","v":""},{"$f":"JAWABAN_PG!AF98","v":""},{"$f":"JAWABAN_PG!AG98","v":""},{"$f":"JAWABAN_PG!AH98","v":""},{"$f":"JAWABAN_PG!AI98","v":""},{"$f":"JAWABAN_PG!AJ98","v":""},{"$f":"JAWABAN_PG!AK98","v":""},{"$f":"JAWABAN_PG!AL98","v":""},{"$f":"JAWABAN_PG!AM98","v":""},{"$f":"JAWABAN_PG!AN98","v":""},{"$f":"JAWABAN_PG!AO98","v":""},{"$f":"JAWABAN_PG!AP98","v":""},{"$f":"JAWABAN_PG!AQ98","v":""},{"$f":"JAWABAN_PG!AR98","v":""},{"$f":"JAWABAN_PG!AS98","v":""},{"$f":"JAWABAN_PG!AT98","v":""},{"$f":"JAWABAN_PG!AU98","v":""},{"$f":"JAWABAN_PG!AV98","v":""},{"$f":"JAWABAN_PG!AW98","v":""},{"$f":"JAWABAN_PG!AX98","v":""},{"$f":"JAWABAN_PG!AY98","v":""},{"$f":"JAWABAN_PG!AZ98","v":""},{"$f":"JAWABAN_PG!BA98","v":""},{"$f":"SUM(D9:BA9)","v":60},{"$f":"IF(BB9>=DATA!$G$15,\"TUNTAS\",\"BELUM TUNTAS\")","v":"BELUM TUNTAS"}]
[3,{"$f":"IF(VALUE(DATA!B8)=0, \"\", TEXT(VALUE(DATA!B8), REPT(\"0\", LEN(DATA!B8))))","v":"0099072726"},{"$f":"IF(DATA!C8=\"\",\"\",DATA!C8)","v":"AMELIA CARISA PUTRI"},{"$f":"JAWABAN_PG!D99","v":0},{"$f":"JAWABAN_PG!E99","v":5},{"$f":"JAWABAN_PG!F99","v":5},{"$f":"JAWABAN_PG!G99","v":5},{"$f":"JAWABAN_PG!H99","v":5},{"$f":"JAWABAN_PG!I99","v":5},{"$f":"JAWABAN_PG!J99","v":5},{"$f":"JAWABAN_PG!K99","v":0},{"$f":"JAWABAN_PG!L99","v":0},{"$f":"JAWABAN_PG!M99","v":0},{"$f":"JAWABAN_PG!N99","v":5},{"$f":"JAWABAN_PG!O99","v":0},{"$f":"JAWABAN_PG!P99","v":5},{"$f":"JAWABAN_PG!Q99","v":5},{"$f":"JAWABAN_PG!R99","v":5},{"$f":"JAWABAN_PG!S99","v":5},{"$f":"JAWABAN_PG!T99","v":0},{"$f":"JAWABAN_PG!U99","v":5},{"$f":"JAWABAN_PG!V99","v":5},{"$f":"JAWABAN_PG!W99","v":5},{"$f":"JAWABAN_PG!X99","v":""},{"$f":"JAWABAN_PG!Y99","v":""},{"$f":"JAWABAN_PG!Z99","v":""},{"$f":"JAWABAN_PG!AA99","v":""},{"$f":"JAWABAN_PG!AB99","v":""},{"$f":"JAWABAN_PG!AC99","v":""},{"$f":"JAWABAN_PG!AD99","v":""},{"$f":"JAWABAN_PG!AE99","v":""},{"$f":"JAWABAN_PG!AF99","v":""},{"$f":"JAWABAN_PG!AG99","v":""},{"$f":"JAWABAN_PG!AH99","v":""},{"$f":"JAWABAN_PG!AI99","v":""},{"$f":"JAWABAN_PG!AJ99","v":""},{"$f":"JAWABAN_PG!AK99","v":""},{"$f":"JAWABAN_PG!AL99","v":""},{"$f":"JAWABAN_PG!AM99","v":""},{"$f":"JAWABAN_PG!AN99","v":""},{"$f":"JAWABAN_PG!AO99","v":""},{"$f":"JAWABAN_PG!AP99","v":""},{"$f":"JAWABAN_PG!AQ99","v":""},{"$f":"JAWABAN_PG!AR99","v":""},{"$f":"JAWABAN_PG!AS99","v":""},{"$f":"JAWABAN_PG!AT99","v":""},{"$f":"JAWABAN_PG!AU99","v":""},{"$f":"JAWABAN_PG!AV99","v":""},{"$f":"JAWABAN_PG!AW99","v":""},{"$f":"JAWABAN_PG!AX99","v":""},{"$f":"JAWABAN_PG!AY99","v":""},{"$f":"JAWABAN_PG!AZ99","v":""},{"$f":"JAWABAN_PG!BA99","v":""},70,{"$f":"IF(BB10>=DATA!$G$15,\"TUNTAS\",\"BELUM TUNTAS\")","v":"BELUM TUNTAS"}]
{"$rows_left_out":56}
{"sheet":"TK_KESUKARAN_PG","index":3,"n_rows":92,"n_cols":4,"rows_kept":92,"cut":false,"hidden":false,"merged":[]}
[{"$f":"STATISTIK_PG!BC53","v":20}]
[{"$f":"STATISTIK_PG!BC53","v":20},"B. TINGKAT KESUKARAN SOAL PILIHAN GANDA"]
[]
[null,"Mata Pelajaran",{"$f":"CONCATENATE(\":\",\" \",DATA!G11)","v":": Kimia"}]
[null,"Kelas",{"$f":"CONCATENATE(\":\",\" \",DATA!G12)","v":": X-A"}]
[null,"Semester",{"$f":"CONCATENATE(\":\",\" \",DATA!G13)","v":": 1 (Ganjil)"}]
[null,"Tahun Pelajaran",{"$f":"CONCATENATE(\":\",\" \",DATA!G14)","v":": 2025/2026"}]
[]
[null,"NO SOAL","SKOR","TINGKAT KESUKARAN"]
[null,1,{"$f":"INDEX(STATISTIK_PG!$D$55:$BA$55, ROW(A1))","v":0},{"$f":"IF(C10<=0.3,\"Sukar\",IF(C10<=0.7,\"Sedang\",\"Mudah\"))","v":"Sukar"}]
{"$rows_left_out":83}
{"sheet":"DY_BEDA_PG","index":4,"n_rows":93,"n_cols":4,"rows_kept":93,"cut":false,"hidden":false,"merged":[]}
[{"$f":"TK_KESUKARAN_PG!A1","v":20}]
[{"$f":"STATISTIK_PG!BC53","v":20},"C. DAYA BEDA SOAL PILIHAN GANDA"]
[]
[null,"Mata Pelajaran",{"$f":"CONCATENATE(\":\",\" \",DATA!G11)","v":": Kimia"}]
[null,"Kelas",{"$f":"CONCATENATE(\":\",\" \",DATA!G12)","v":": X-A"}]
[null,"Semester",{"$f":"CONCATENATE(\":\",\" \",DATA!G13)","v":": 1 (Ganjil)"}]
[null,"Tahun Pelajaran",{"$f":"CONCATENATE(\":\",\" \",DATA!G14)","v":": 2025/2026"}]
[]
[null,"NO SOAL","SKOR","STATUS SOAL"]
[null,1,{"$f":"INDEX(STATISTIK_PG!$D$56:$BA$56, ROW(A1))","v":0},{"$f":"IF(C10<0.15,\"soal dibuang\",\n    IF(C10<0.2,\"soal diperbaiki\",\n        IF(C10<0.3,\"soal diterima tapi perlu perbaikan\",\n            \"soal diterima\"\n        )\n    )\n)","v":"soal dibuang"}]
{"$rows_left_out":84}
{"sheet":"DH_REMEDIAL_PG","index":5,"n_rows":58,"n_cols":7,"rows_kept":58,"cut":false,"hidden":false,"merged":[[8,5,8,6]]}
[{"$f":"TK_KESUKARAN_PG!A1","v":20}]
[{"$f":"STATISTIK_PG!BC53","v":20},"D. DAFTAR HADIR REMEDIAL (PILIHAN GANDA)"]
[]
[null,"Mata Pelajaran",{"$f":"CONCATENATE(\":\",\" \",DATA!G11)","v":": Kimia"}]
[null,"Kelas",{"$f":"CONCATENATE(\":\",\" \",DATA!G12)","v":": X-A"}]
[null,"Semester",{"$f":"CONCATENATE(\":\",\" \",DATA!G13)","v":": 1 (Ganjil)"}]
[null,"Tahun Pelajaran",{"$f":"CONCATENATE(\":\",\" \",DATA!G14)","v":": 2025/2026"}]
[]
[null,"NO","NISN","NAMA","NO SOAL BELUM TUNTAS","TANDA TANGAN"]
[null,1,{"$f":"IF(VALUE(DATA!B6)=0, \"\", TEXT(VALUE(DATA!B6), REPT(\"0\", LEN(DATA!B6))))","v":"0104009164"},{"$f":"IF(DATA!C6=\"\",\"\",DATA!C6)","v":"AGUS FIRMAN SYABANI"},{"$f":"JAWABAN_PG!BB50","v":"1; 4; 9; 12; 16; 17"},1]
{"$rows_left_out":49}
{"sheet":"COVER_PG","index":6,"n_rows":51,"n_cols":6,"rows_kept":51,"cut":false,"hidden":false,"merged":[[47,0,47,8],[48,0,48,8],[49,0,49,8],[50,0,50,8],[13,5,15,7],[36,0,36,8],[37,0,37,8],[38,0,38,8],[46,0,46,8],[11,5,11,7],[1,0,1,8],[2,0,2,8],[8,5,8,7],[9,5,9,7],[10,5,10,7]]}
[]
["ANALISIS BUTIR SOAL PILIHAN GANDA"]
[{"$f":"DATA!G16","v":"Asesmen Sumatif Akhir Semester"}]
[]
[]
[]
[]
[]
[null,"Mata Pelajaran",null,null,":",{"$f":"DATA!G11","v":"Kimia"}]
[null,"Kelas",null,null,":",{"$f":"DATA!G12","v":"X-A"}]
{"$rows_left_out":41}